{"text_format":"1","workbook":"xlsx","n_sheets":23,"sheets":["FY 2021 SNF PDPM Rates","Alpha_Crosswalk","Base_Rates","Case-Mix_Rates","PT_Analysis","OT_Analysis","SLP_Analysis","Nursing_Analysis","NTA_Analysis","Case-Mix_Descriptions","VPD","PT","OT","SLP","NTA","Nursing","FY 2019 SNF PPS Rates","Data - Rates","Data - CBSA Codes","Data - Wage Indexes","Proof","Data - CBSA Designations","Source"],"not_rendered":{"charts":0,"images":3,"macros":0,"external_links":9,"defined_names":121,"comments":0,"pivot_tables":1},"unopened":[],"bounds":{"document_bytes":16777216,"sheet_cells":100000,"rows_first":2000,"rows_last":500,"rows_between":2000,"halvings":0,"cell_chars":16384,"cell_head_chars":4096},"cells_cut":0,"cells_raw":0,"read":"whole","date_system":"1900"}

{"sheet":"FY 2021 SNF PDPM Rates","index":0,"n_rows":47,"n_cols":20,"rows_kept":47,"cut":false,"hidden":false,"merged":[[44,2,44,15],[45,2,45,11],[2,18,2,21],[41,2,43,15],[2,1,2,16],[10,1,11,2],[10,3,11,4],[4,14,11,16],[31,2,31,5],[21,13,21,14],[26,13,26,14],[13,13,13,14],[13,10,13,11],[13,7,13,8],[27,13,27,14],[4,6,4,13],[29,13,29,15]]}
[]
[]
[null,"Skilled Nursing Medicare Part A FY 2021 SNF PPS PDPM RATES",null,null,null,null,null,null,null,null,null,null,null,null,null,null,null,null,"Tip"]
[null,null,null,null,null,null,null,null,null,null,null,null,null,null,null,null,null,null,null,"If all values are filtered out, click the clear filter"]
[null,null,null,null,null,null,"Select your state and county below:",null,null,null,null,null,null,null,"Rates are effective for services beginning 10/1/2020",null,null,null,null,"image in the top right corner of the slicer."]
[null,null,"Selected County:",{"$f":"'Data - Wage Indexes'!J1","v":"Select a county"}]
[null,null,"CBSA Code:",{"$f":"IF($D$6=\"\",\"Select County\",VLOOKUP($D$6,'Data - Wage Indexes'!$A$2:$C$3222,3,FALSE))","v":{"$error":"#N/A"}},null,null,null,null,null,null,null,null,null,null,null,null,null,null,null,"Example only"]
[null,null,"CBSA Designation:",{"$f":"IF($D$6=\"Select a county\",\"\",VLOOKUP($D$7,CBSADesignations,2,FALSE))","v":""}]
[null,null,"Urban/Rural Status:",{"$f":"IF($D$6=\"Select a county\",\"\",IF(LEFT($D$7,3)=\"999\",\"Rural\",\"Urban\"))","v":""}]
[]
[null,"Wage Index:",null,{"$f":"IFERROR(TEXT(IF($D$6=\"\",\"Select County\",VLOOKUP($D$6,'Data - Wage Indexes'!A1:B3222,2,FALSE)),\"#.####\"),\"1.0000\")","v":"1.0000"}]
[]
[]
[null,null,"PT/OT","PT","OT","PT + OT",null,"SLP",null,null,"Nursing",null,null,"NTA"]
[null,null,"TA",{"$f":"IF($D$9=\"Urban\",('Case-Mix_Rates'!$D2*Base_Rates!$B$9)+('Case-Mix_Rates'!$D2*Base_Rates!$B$11),('Case-Mix_Rates'!$E2*Base_Rates!$B$9)+('Case-Mix_Rates'!$E2*Base_Rates!$B$11))*ROUND($P$32*$P$35,3)","v":108.2016},{"$f":"IF($D$9=\"Urban\",('Case-Mix_Rates'!$G2*Base_Rates!$B$9)+('Case-Mix_Rates'!$G2*Base_Rates!$B$11),('Case-Mix_Rates'!$H2*Base_Rates!$B$9)+('Case-Mix_Rates'!$H2*Base_Rates!$B$11))*ROUND($P$32*$P$35,3)","v":96.775500000000008},{"$f":"+D15+E15","v":204.97710000000001},null,"SA",{"$f":"IF($D$9=\"Urban\",('Case-Mix_Rates'!$K2*Base_Rates!$B$9)+('Case-Mix_Rates'!$K2*Base_Rates!$B$11),('Case-Mix_Rates'!$L2*Base_Rates!$B$9)+('Case-Mix_Rates'!$L2*Base_Rates!$B$11))*ROUND($P$32*$P$35,3)","v":19.842400000000001},null,"ES3",{"$f":"IF($D$9=\"Urban\",('Case-Mix_Rates'!$O2*Base_Rates!$B$9)+('Case-Mix_Rates'!$O2*Base_Rates!$B$11),('Case-Mix_Rates'!$P2*Base_Rates!$B$9)+('Case-Mix_Rates'!$P2*Base_Rates!$B$11))*ROUND($P$32*$P$35,3)","v":419.56039999999996},null,"NA",{"$f":"IF($D$9=\"Urban\",('Case-Mix_Rates'!$S2*Base_Rates!$B$9)+('Case-Mix_Rates'!$S2*Base_Rates!$B$11),('Case-Mix_Rates'!$T2*Base_Rates!$B$9)+('Case-Mix_Rates'!$T2*Base_Rates!$B$11))*ROUND($P$32*$P$35,3)","v":252.59039999999999}]
[null,null,"TB",{"$f":"IF($D$9=\"Urban\",('Case-Mix_Rates'!$D3*Base_Rates!$B$9)+('Case-Mix_Rates'!$D3*Base_Rates!$B$11),('Case-Mix_Rates'!$E3*Base_Rates!$B$9)+('Case-Mix_Rates'!$E3*Base_Rates!$B$11))*ROUND($P$32*$P$35,3)","v":120.22399999999999},{"$f":"IF($D$9=\"Urban\",('Case-Mix_Rates'!$G3*Base_Rates!$B$9)+('Case-Mix_Rates'!$G3*Base_Rates!$B$11),('Case-Mix_Rates'!$H3*Base_Rates!$B$9)+('Case-Mix_Rates'!$H3*Base_Rates!$B$11))*ROUND($P$32*$P$35,3)","v":105.8685},226.09249999999997,null,"SB",{"$f":"IF($D$9=\"Urban\",('Case-Mix_Rates'!$K3*Base_Rates!$B$9)+('Case-Mix_Rates'!$K3*Base_Rates!$B$11),('Case-Mix_Rates'!$L3*Base_Rates!$B$9)+('Case-Mix_Rates'!$L3*Base_Rates!$B$11))*ROUND($P$32*$P$35,3)","v":53.107599999999998},null,"ES2",{"$f":"IF($D$9=\"Urban\",('Case-Mix_Rates'!$O3*Base_Rates!$B$9)+('Case-Mix_Rates'!$O3*Base_Rates!$B$11),('Case-Mix_Rates'!$P3*Base_Rates!$B$9)+('Case-Mix_Rates'!$P3*Base_Rates!$B$11))*ROUND($P$32*$P$35,3)","v":317.25380000000001},null,"NB",{"$f":"IF($D$9=\"Urban\",('Case-Mix_Rates'!$S3*Base_Rates!$B$9)+('Case-Mix_Rates'!$S3*Base_Rates!$B$11),('Case-Mix_Rates'!$T3*Base_Rates!$B$9)+('Case-Mix_Rates'!$T3*Base_Rates!$B$11))*ROUND($P$32*$P$35,3)","v":197.23879999999997}]
[null,null,"TC",{"$f":"IF($D$9=\"Urban\",('Case-Mix_Rates'!$D4*Base_Rates!$B$9)+('Case-Mix_Rates'!$D4*Base_Rates!$B$11),('Case-Mix_Rates'!$E4*Base_Rates!$B$9)+('Case-Mix_Rates'!$E4*Base_Rates!$B$11))*ROUND($P$32*$P$35,3)","v":132.95359999999999},{"$f":"IF($D$9=\"Urban\",('Case-Mix_Rates'!$G4*Base_Rates!$B$9)+('Case-Mix_Rates'!$G4*Base_Rates!$B$11),('Case-Mix_Rates'!$H4*Base_Rates!$B$9)+('Case-Mix_Rates'!$H4*Base_Rates!$B$11))*ROUND($P$32*$P$35,3)","v":109.7655},242.7191,null,"SC",{"$f":"IF($D$9=\"Urban\",('Case-Mix_Rates'!$K4*Base_Rates!$B$9)+('Case-Mix_Rates'!$K4*Base_Rates!$B$11),('Case-Mix_Rates'!$L4*Base_Rates!$B$9)+('Case-Mix_Rates'!$L4*Base_Rates!$B$11))*ROUND($P$32*$P$35,3)","v":77.910600000000002},null,"ES1",{"$f":"IF($D$9=\"Urban\",('Case-Mix_Rates'!$O4*Base_Rates!$B$9)+('Case-Mix_Rates'!$O4*Base_Rates!$B$11),('Case-Mix_Rates'!$P4*Base_Rates!$B$9)+('Case-Mix_Rates'!$P4*Base_Rates!$B$11))*ROUND($P$32*$P$35,3)","v":302.78620000000001},null,"NC",{"$f":"IF($D$9=\"Urban\",('Case-Mix_Rates'!$S4*Base_Rates!$B$9)+('Case-Mix_Rates'!$S4*Base_Rates!$B$11),('Case-Mix_Rates'!$T4*Base_Rates!$B$9)+('Case-Mix_Rates'!$T4*Base_Rates!$B$11))*ROUND($P$32*$P$35,3)","v":143.44639999999998}]
[null,null,"TD",{"$f":"IF($D$9=\"Urban\",('Case-Mix_Rates'!$D5*Base_Rates!$B$9)+('Case-Mix_Rates'!$D5*Base_Rates!$B$11),('Case-Mix_Rates'!$E5*Base_Rates!$B$9)+('Case-Mix_Rates'!$E5*Base_Rates!$B$11))*ROUND($P$32*$P$35,3)","v":135.7824},{"$f":"IF($D$9=\"Urban\",('Case-Mix_Rates'!$G5*Base_Rates!$B$9)+('Case-Mix_Rates'!$G5*Base_Rates!$B$11),('Case-Mix_Rates'!$H5*Base_Rates!$B$9)+('Case-Mix_Rates'!$H5*Base_Rates!$B$11))*ROUND($P$32*$P$35,3)","v":99.373500000000007},235.1559,null,"SD",{"$f":"IF($D$9=\"Urban\",('Case-Mix_Rates'!$K5*Base_Rates!$B$9)+('Case-Mix_Rates'!$K5*Base_Rates!$B$11),('Case-Mix_Rates'!$L5*Base_Rates!$B$9)+('Case-Mix_Rates'!$L5*Base_Rates!$B$11))*ROUND($P$32*$P$35,3)","v":42.602800000000002},null,"HDE2",{"$f":"IF($D$9=\"Urban\",('Case-Mix_Rates'!$O5*Base_Rates!$B$9)+('Case-Mix_Rates'!$O5*Base_Rates!$B$11),('Case-Mix_Rates'!$P5*Base_Rates!$B$9)+('Case-Mix_Rates'!$P5*Base_Rates!$B$11))*ROUND($P$32*$P$35,3)","v":248.01599999999996},null,"ND",{"$f":"IF($D$9=\"Urban\",('Case-Mix_Rates'!$S5*Base_Rates!$B$9)+('Case-Mix_Rates'!$S5*Base_Rates!$B$11),('Case-Mix_Rates'!$T5*Base_Rates!$B$9)+('Case-Mix_Rates'!$T5*Base_Rates!$B$11))*ROUND($P$32*$P$35,3)","v":103.68679999999998}]
[null,null,"TE",{"$f":"IF($D$9=\"Urban\",('Case-Mix_Rates'!$D6*Base_Rates!$B$9)+('Case-Mix_Rates'!$D6*Base_Rates!$B$11),('Case-Mix_Rates'!$E6*Base_Rates!$B$9)+('Case-Mix_Rates'!$E6*Base_Rates!$B$11))*ROUND($P$32*$P$35,3)","v":100.4224},{"$f":"IF($D$9=\"Urban\",('Case-Mix_Rates'!$G6*Base_Rates!$B$9)+('Case-Mix_Rates'!$G6*Base_Rates!$B$11),('Case-Mix_Rates'!$H6*Base_Rates!$B$9)+('Case-Mix_Rates'!$H6*Base_Rates!$B$11))*ROUND($P$32*$P$35,3)","v":91.579499999999996},192.00189999999998,null,"SE",{"$f":"IF($D$9=\"Urban\",('Case-Mix_Rates'!$K6*Base_Rates!$B$9)+('Case-Mix_Rates'!$K6*Base_Rates!$B$11),('Case-Mix_Rates'!$L6*Base_Rates!$B$9)+('Case-Mix_Rates'!$L6*Base_Rates!$B$11))*ROUND($P$32*$P$35,3)","v":68.281199999999998},null,"HDE1",{"$f":"IF($D$9=\"Urban\",('Case-Mix_Rates'!$O6*Base_Rates!$B$9)+('Case-Mix_Rates'!$O6*Base_Rates!$B$11),('Case-Mix_Rates'!$P6*Base_Rates!$B$9)+('Case-Mix_Rates'!$P6*Base_Rates!$B$11))*ROUND($P$32*$P$35,3)","v":205.64660000000001},null,"NE",{"$f":"IF($D$9=\"Urban\",('Case-Mix_Rates'!$S6*Base_Rates!$B$9)+('Case-Mix_Rates'!$S6*Base_Rates!$B$11),('Case-Mix_Rates'!$T6*Base_Rates!$B$9)+('Case-Mix_Rates'!$T6*Base_Rates!$B$11))*ROUND($P$32*$P$35,3)","v":74.841599999999985}]
[null,null,"TF",{"$f":"IF($D$9=\"Urban\",('Case-Mix_Rates'!$D7*Base_Rates!$B$9)+('Case-Mix_Rates'!$D7*Base_Rates!$B$11),('Case-Mix_Rates'!$E7*Base_Rates!$B$9)+('Case-Mix_Rates'!$E7*Base_Rates!$B$11))*ROUND($P$32*$P$35,3)","v":113.85920000000002},{"$f":"IF($D$9=\"Urban\",('Case-Mix_Rates'!$G7*Base_Rates!$B$9)+('Case-Mix_Rates'!$G7*Base_Rates!$B$11),('Case-Mix_Rates'!$H7*Base_Rates!$B$9)+('Case-Mix_Rates'!$H7*Base_Rates!$B$11))*ROUND($P$32*$P$35,3)","v":103.92000000000002},217.77920000000003,null,"SF",{"$f":"IF($D$9=\"Urban\",('Case-Mix_Rates'!$K7*Base_Rates!$B$9)+('Case-Mix_Rates'!$K7*Base_Rates!$B$11),('Case-Mix_Rates'!$L7*Base_Rates!$B$9)+('Case-Mix_Rates'!$L7*Base_Rates!$B$11))*ROUND($P$32*$P$35,3)","v":86.956400000000002},null,"HBC2",{"$f":"IF($D$9=\"Urban\",('Case-Mix_Rates'!$O7*Base_Rates!$B$9)+('Case-Mix_Rates'!$O7*Base_Rates!$B$11),('Case-Mix_Rates'!$P7*Base_Rates!$B$9)+('Case-Mix_Rates'!$P7*Base_Rates!$B$11))*ROUND($P$32*$P$35,3)","v":231.48160000000007},null,"NF",{"$f":"IF($D$9=\"Urban\",('Case-Mix_Rates'!$S7*Base_Rates!$B$9)+('Case-Mix_Rates'!$S7*Base_Rates!$B$11),('Case-Mix_Rates'!$T7*Base_Rates!$B$9)+('Case-Mix_Rates'!$T7*Base_Rates!$B$11))*ROUND($P$32*$P$35,3)","v":56.131199999999993}]
[null,null,"TG",{"$f":"IF($D$9=\"Urban\",('Case-Mix_Rates'!$D8*Base_Rates!$B$9)+('Case-Mix_Rates'!$D8*Base_Rates!$B$11),('Case-Mix_Rates'!$E8*Base_Rates!$B$9)+('Case-Mix_Rates'!$E8*Base_Rates!$B$11))*ROUND($P$32*$P$35,3)","v":118.10239999999999},{"$f":"IF($D$9=\"Urban\",('Case-Mix_Rates'!$G8*Base_Rates!$B$9)+('Case-Mix_Rates'!$G8*Base_Rates!$B$11),('Case-Mix_Rates'!$H8*Base_Rates!$B$9)+('Case-Mix_Rates'!$H8*Base_Rates!$B$11))*ROUND($P$32*$P$35,3)","v":106.518},224.62039999999999,null,"SG",{"$f":"IF($D$9=\"Urban\",('Case-Mix_Rates'!$K8*Base_Rates!$B$9)+('Case-Mix_Rates'!$K8*Base_Rates!$B$11),('Case-Mix_Rates'!$L8*Base_Rates!$B$9)+('Case-Mix_Rates'!$L8*Base_Rates!$B$11))*ROUND($P$32*$P$35,3)","v":59.527200000000001},null,"HBC1",{"$f":"IF($D$9=\"Urban\",('Case-Mix_Rates'!$O8*Base_Rates!$B$9)+('Case-Mix_Rates'!$O8*Base_Rates!$B$11),('Case-Mix_Rates'!$P8*Base_Rates!$B$9)+('Case-Mix_Rates'!$P8*Base_Rates!$B$11))*ROUND($P$32*$P$35,3)","v":192.2124}]
[null,null,"TH",{"$f":"IF($D$9=\"Urban\",('Case-Mix_Rates'!$D9*Base_Rates!$B$9)+('Case-Mix_Rates'!$D9*Base_Rates!$B$11),('Case-Mix_Rates'!$E9*Base_Rates!$B$9)+('Case-Mix_Rates'!$E9*Base_Rates!$B$11))*ROUND($P$32*$P$35,3)","v":82.035199999999989},{"$f":"IF($D$9=\"Urban\",('Case-Mix_Rates'!$G9*Base_Rates!$B$9)+('Case-Mix_Rates'!$G9*Base_Rates!$B$11),('Case-Mix_Rates'!$H9*Base_Rates!$B$9)+('Case-Mix_Rates'!$H9*Base_Rates!$B$11))*ROUND($P$32*$P$35,3)","v":74.692499999999995},156.72769999999997,null,"SH",{"$f":"IF($D$9=\"Urban\",('Case-Mix_Rates'!$K9*Base_Rates!$B$9)+('Case-Mix_Rates'!$K9*Base_Rates!$B$11),('Case-Mix_Rates'!$L9*Base_Rates!$B$9)+('Case-Mix_Rates'!$L9*Base_Rates!$B$11))*ROUND($P$32*$P$35,3)","v":83.454799999999992},null,"LDE2",{"$f":"IF($D$9=\"Urban\",('Case-Mix_Rates'!$O9*Base_Rates!$B$9)+('Case-Mix_Rates'!$O9*Base_Rates!$B$11),('Case-Mix_Rates'!$P9*Base_Rates!$B$9)+('Case-Mix_Rates'!$P9*Base_Rates!$B$11))*ROUND($P$32*$P$35,3)","v":214.94720000000001},null,"VPDA Example"]
[null,null,"TI",{"$f":"IF($D$9=\"Urban\",('Case-Mix_Rates'!$D10*Base_Rates!$B$9)+('Case-Mix_Rates'!$D10*Base_Rates!$B$11),('Case-Mix_Rates'!$E10*Base_Rates!$B$9)+('Case-Mix_Rates'!$E10*Base_Rates!$B$11))*ROUND($P$32*$P$35,3)","v":79.913599999999988},{"$f":"IF($D$9=\"Urban\",('Case-Mix_Rates'!$G10*Base_Rates!$B$9)+('Case-Mix_Rates'!$G10*Base_Rates!$B$11),('Case-Mix_Rates'!$H10*Base_Rates!$B$9)+('Case-Mix_Rates'!$H10*Base_Rates!$B$11))*ROUND($P$32*$P$35,3)","v":76.641000000000005},156.55459999999999,null,"SI",{"$f":"IF($D$9=\"Urban\",('Case-Mix_Rates'!$K10*Base_Rates!$B$9)+('Case-Mix_Rates'!$K10*Base_Rates!$B$11),('Case-Mix_Rates'!$L10*Base_Rates!$B$9)+('Case-Mix_Rates'!$L10*Base_Rates!$B$11))*ROUND($P$32*$P$35,3)","v":103.00539999999999},null,"LDE1",{"$f":"IF($D$9=\"Urban\",('Case-Mix_Rates'!$O10*Base_Rates!$B$9)+('Case-Mix_Rates'!$O10*Base_Rates!$B$11),('Case-Mix_Rates'!$P10*Base_Rates!$B$9)+('Case-Mix_Rates'!$P10*Base_Rates!$B$11))*ROUND($P$32*$P$35,3)","v":178.7782},null,"Period","Adjustment"]
[null,null,"TJ",{"$f":"IF($D$9=\"Urban\",('Case-Mix_Rates'!$D11*Base_Rates!$B$9)+('Case-Mix_Rates'!$D11*Base_Rates!$B$11),('Case-Mix_Rates'!$E11*Base_Rates!$B$9)+('Case-Mix_Rates'!$E11*Base_Rates!$B$11))*ROUND($P$32*$P$35,3)","v":100.4224},{"$f":"IF($D$9=\"Urban\",('Case-Mix_Rates'!$G11*Base_Rates!$B$9)+('Case-Mix_Rates'!$G11*Base_Rates!$B$11),('Case-Mix_Rates'!$H11*Base_Rates!$B$9)+('Case-Mix_Rates'!$H11*Base_Rates!$B$11))*ROUND($P$32*$P$35,3)","v":94.177499999999995},194.59989999999999,null,"SJ",{"$f":"IF($D$9=\"Urban\",('Case-Mix_Rates'!$K11*Base_Rates!$B$9)+('Case-Mix_Rates'!$K11*Base_Rates!$B$11),('Case-Mix_Rates'!$L11*Base_Rates!$B$9)+('Case-Mix_Rates'!$L11*Base_Rates!$B$11))*ROUND($P$32*$P$35,3)","v":87.248200000000011},null,"LBC2",{"$f":"IF($D$9=\"Urban\",('Case-Mix_Rates'!$O11*Base_Rates!$B$9)+('Case-Mix_Rates'!$O11*Base_Rates!$B$11),('Case-Mix_Rates'!$P11*Base_Rates!$B$9)+('Case-Mix_Rates'!$P11*Base_Rates!$B$11))*ROUND($P$32*$P$35,3)","v":177.7448},null,"Days 1 - 3",3]
[null,null,"TK",{"$f":"IF($D$9=\"Urban\",('Case-Mix_Rates'!$D12*Base_Rates!$B$9)+('Case-Mix_Rates'!$D12*Base_Rates!$B$11),('Case-Mix_Rates'!$E12*Base_Rates!$B$9)+('Case-Mix_Rates'!$E12*Base_Rates!$B$11))*ROUND($P$32*$P$35,3)","v":107.49440000000001},{"$f":"IF($D$9=\"Urban\",('Case-Mix_Rates'!$G12*Base_Rates!$B$9)+('Case-Mix_Rates'!$G12*Base_Rates!$B$11),('Case-Mix_Rates'!$H12*Base_Rates!$B$9)+('Case-Mix_Rates'!$H12*Base_Rates!$B$11))*ROUND($P$32*$P$35,3)","v":100.02300000000001},207.51740000000001,null,"SK",{"$f":"IF($D$9=\"Urban\",('Case-Mix_Rates'!$K12*Base_Rates!$B$9)+('Case-Mix_Rates'!$K12*Base_Rates!$B$11),('Case-Mix_Rates'!$L12*Base_Rates!$B$9)+('Case-Mix_Rates'!$L12*Base_Rates!$B$11))*ROUND($P$32*$P$35,3)","v":107.96600000000001},null,"LBC1",{"$f":"IF($D$9=\"Urban\",('Case-Mix_Rates'!$O12*Base_Rates!$B$9)+('Case-Mix_Rates'!$O12*Base_Rates!$B$11),('Case-Mix_Rates'!$P12*Base_Rates!$B$9)+('Case-Mix_Rates'!$P12*Base_Rates!$B$11))*ROUND($P$32*$P$35,3)","v":147.77619999999999},null,"Days 4 +",1]
[null,null,"TL",{"$f":"IF($D$9=\"Urban\",('Case-Mix_Rates'!$D13*Base_Rates!$B$9)+('Case-Mix_Rates'!$D13*Base_Rates!$B$11),('Case-Mix_Rates'!$E13*Base_Rates!$B$9)+('Case-Mix_Rates'!$E13*Base_Rates!$B$11))*ROUND($P$32*$P$35,3)","v":77.084800000000001},{"$f":"IF($D$9=\"Urban\",('Case-Mix_Rates'!$G13*Base_Rates!$B$9)+('Case-Mix_Rates'!$G13*Base_Rates!$B$11),('Case-Mix_Rates'!$H13*Base_Rates!$B$9)+('Case-Mix_Rates'!$H13*Base_Rates!$B$11))*ROUND($P$32*$P$35,3)","v":72.094500000000011},149.17930000000001,null,"SL",{"$f":"IF($D$9=\"Urban\",('Case-Mix_Rates'!$K13*Base_Rates!$B$9)+('Case-Mix_Rates'!$K13*Base_Rates!$B$11),('Case-Mix_Rates'!$L13*Base_Rates!$B$9)+('Case-Mix_Rates'!$L13*Base_Rates!$B$11))*ROUND($P$32*$P$35,3)","v":122.84779999999999},null,"CDE2",{"$f":"IF($D$9=\"Urban\",('Case-Mix_Rates'!$O13*Base_Rates!$B$9)+('Case-Mix_Rates'!$O13*Base_Rates!$B$11),('Case-Mix_Rates'!$P13*Base_Rates!$B$9)+('Case-Mix_Rates'!$P13*Base_Rates!$B$11))*ROUND($P$32*$P$35,3)","v":193.24580000000003}]
[null,null,"TM",{"$f":"IF($D$9=\"Urban\",('Case-Mix_Rates'!$D14*Base_Rates!$B$9)+('Case-Mix_Rates'!$D14*Base_Rates!$B$11),('Case-Mix_Rates'!$E14*Base_Rates!$B$9)+('Case-Mix_Rates'!$E14*Base_Rates!$B$11))*ROUND($P$32*$P$35,3)","v":89.814400000000006},{"$f":"IF($D$9=\"Urban\",('Case-Mix_Rates'!$G14*Base_Rates!$B$9)+('Case-Mix_Rates'!$G14*Base_Rates!$B$11),('Case-Mix_Rates'!$H14*Base_Rates!$B$9)+('Case-Mix_Rates'!$H14*Base_Rates!$B$11))*ROUND($P$32*$P$35,3)","v":84.435000000000002},174.24940000000001,null,{"$f":"\"\"","v":""},null,null,"CDE1",{"$f":"IF($D$9=\"Urban\",('Case-Mix_Rates'!$O14*Base_Rates!$B$9)+('Case-Mix_Rates'!$O14*Base_Rates!$B$11),('Case-Mix_Rates'!$P14*Base_Rates!$B$9)+('Case-Mix_Rates'!$P14*Base_Rates!$B$11))*ROUND($P$32*$P$35,3)","v":167.41080000000002},null,"Non-Case-Mix"]
[null,null,"TN",{"$f":"IF($D$9=\"Urban\",('Case-Mix_Rates'!$D15*Base_Rates!$B$9)+('Case-Mix_Rates'!$D15*Base_Rates!$B$11),('Case-Mix_Rates'!$E15*Base_Rates!$B$9)+('Case-Mix_Rates'!$E15*Base_Rates!$B$11))*ROUND($P$32*$P$35,3)","v":104.6656},{"$f":"IF($D$9=\"Urban\",('Case-Mix_Rates'!$G15*Base_Rates!$B$9)+('Case-Mix_Rates'!$G15*Base_Rates!$B$11),('Case-Mix_Rates'!$H15*Base_Rates!$B$9)+('Case-Mix_Rates'!$H15*Base_Rates!$B$11))*ROUND($P$32*$P$35,3)","v":97.425000000000011},202.09059999999999,null,null,null,null,"CBC2",{"$f":"IF($D$9=\"Urban\",('Case-Mix_Rates'!$O15*Base_Rates!$B$9)+('Case-Mix_Rates'!$O15*Base_Rates!$B$11),('Case-Mix_Rates'!$P15*Base_Rates!$B$9)+('Case-Mix_Rates'!$P15*Base_Rates!$B$11))*ROUND($P$32*$P$35,3)","v":160.17700000000002},null,{"$f":"TEXT(IF($D$9=\"Urban\",(Base_Rates!$G3*Base_Rates!$B$9)+(Base_Rates!$G3*Base_Rates!$B$11),(Base_Rates!$G4*Base_Rates!$B$9)+(Base_Rates!$G4*Base_Rates!$B$11)),\"$#.##\")*ROUND($P$32*$P$35,3)","v":98.64}]
[null,null,"TO",{"$f":"IF($D$9=\"Urban\",('Case-Mix_Rates'!$D16*Base_Rates!$B$9)+('Case-Mix_Rates'!$D16*Base_Rates!$B$11),('Case-Mix_Rates'!$E16*Base_Rates!$B$9)+('Case-Mix_Rates'!$E16*Base_Rates!$B$11))*ROUND($P$32*$P$35,3)","v":109.616},{"$f":"IF($D$9=\"Urban\",('Case-Mix_Rates'!$G16*Base_Rates!$B$9)+('Case-Mix_Rates'!$G16*Base_Rates!$B$11),('Case-Mix_Rates'!$H16*Base_Rates!$B$9)+('Case-Mix_Rates'!$H16*Base_Rates!$B$11))*ROUND($P$32*$P$35,3)","v":100.67250000000001},210.2885,null,null,null,null,"CA2",{"$f":"IF($D$9=\"Urban\",('Case-Mix_Rates'!$O16*Base_Rates!$B$9)+('Case-Mix_Rates'!$O16*Base_Rates!$B$11),('Case-Mix_Rates'!$P16*Base_Rates!$B$9)+('Case-Mix_Rates'!$P16*Base_Rates!$B$11))*ROUND($P$32*$P$35,3)","v":112.64060000000001}]
[null,null,"TP",{"$f":"IF($D$9=\"Urban\",('Case-Mix_Rates'!$D17*Base_Rates!$B$9)+('Case-Mix_Rates'!$D17*Base_Rates!$B$11),('Case-Mix_Rates'!$E17*Base_Rates!$B$9)+('Case-Mix_Rates'!$E17*Base_Rates!$B$11))*ROUND($P$32*$P$35,3)","v":76.377600000000001},{"$f":"IF($D$9=\"Urban\",('Case-Mix_Rates'!$G17*Base_Rates!$B$9)+('Case-Mix_Rates'!$G17*Base_Rates!$B$11),('Case-Mix_Rates'!$H17*Base_Rates!$B$9)+('Case-Mix_Rates'!$H17*Base_Rates!$B$11))*ROUND($P$32*$P$35,3)","v":70.795500000000004},147.17310000000001,null,null,null,null,"CBC1",{"$f":"IF($D$9=\"Urban\",('Case-Mix_Rates'!$O17*Base_Rates!$B$9)+('Case-Mix_Rates'!$O17*Base_Rates!$B$11),('Case-Mix_Rates'!$P17*Base_Rates!$B$9)+('Case-Mix_Rates'!$P17*Base_Rates!$B$11))*ROUND($P$32*$P$35,3)","v":138.47560000000001},null,"Facility Specific Factors"]
[null,null,{"$f":"\"\"","v":""},null,null,null,null,null,null,null,"CA1",{"$f":"IF($D$9=\"Urban\",('Case-Mix_Rates'!$O18*Base_Rates!$B$9)+('Case-Mix_Rates'!$O18*Base_Rates!$B$11),('Case-Mix_Rates'!$P18*Base_Rates!$B$9)+('Case-Mix_Rates'!$P18*Base_Rates!$B$11))*ROUND($P$32*$P$35,3)","v":97.139600000000002}]
[null,null,"Variable Per Diem Adjustment (VPDA) Example",null,null,null,null,null,null,null,"BAB2",{"$f":"IF($D$9=\"Urban\",('Case-Mix_Rates'!$O19*Base_Rates!$B$9)+('Case-Mix_Rates'!$O19*Base_Rates!$B$11),('Case-Mix_Rates'!$P19*Base_Rates!$B$9)+('Case-Mix_Rates'!$P19*Base_Rates!$B$11))*ROUND($P$32*$P$35,3)","v":107.4736},null,"Value-Based Purchasing (VBP)",null,1]
[null,null,"Period","Begin","End","Adjustment",null,null,null,null,"BAB1",{"$f":"IF($D$9=\"Urban\",('Case-Mix_Rates'!$O20*Base_Rates!$B$9)+('Case-Mix_Rates'!$O20*Base_Rates!$B$11),('Case-Mix_Rates'!$P20*Base_Rates!$B$9)+('Case-Mix_Rates'!$P20*Base_Rates!$B$11))*ROUND($P$32*$P$35,3)","v":102.3066},null,"(VBP factor ranges between 98% and 104%)"]
[null,null,1,0,20,1,null,null,null,null,"PDE2",{"$f":"IF($D$9=\"Urban\",('Case-Mix_Rates'!$O21*Base_Rates!$B$9)+('Case-Mix_Rates'!$O21*Base_Rates!$B$11),('Case-Mix_Rates'!$P21*Base_Rates!$B$9)+('Case-Mix_Rates'!$P21*Base_Rates!$B$11))*ROUND($P$32*$P$35,3)","v":162.24380000000002}]
[null,null,2,21,{"$f":"+E34+7","v":27},0.98,null,null,null,null,"PDE1",{"$f":"IF($D$9=\"Urban\",('Case-Mix_Rates'!$O22*Base_Rates!$B$9)+('Case-Mix_Rates'!$O22*Base_Rates!$B$11),('Case-Mix_Rates'!$P22*Base_Rates!$B$9)+('Case-Mix_Rates'!$P22*Base_Rates!$B$11))*ROUND($P$32*$P$35,3)","v":151.90979999999999},null,"Quality Reporting Progam (QRP)",null,1]
[null,null,3,{"$f":"+D35+7","v":28},{"$f":"+E35+7","v":34},0.96,null,null,null,null,"PBC2",{"$f":"IF($D$9=\"Urban\",('Case-Mix_Rates'!$O23*Base_Rates!$B$9)+('Case-Mix_Rates'!$O23*Base_Rates!$B$11),('Case-Mix_Rates'!$P23*Base_Rates!$B$9)+('Case-Mix_Rates'!$P23*Base_Rates!$B$11))*ROUND($P$32*$P$35,3)","v":126.0748},null,"(QRP factor is either 98% or 100%)"]
[null,null,4,{"$f":"+D36+7","v":35},{"$f":"+E36+7","v":41},0.94,null,null,null,null,"PA2",{"$f":"IF($D$9=\"Urban\",('Case-Mix_Rates'!$O24*Base_Rates!$B$9)+('Case-Mix_Rates'!$O24*Base_Rates!$B$11),('Case-Mix_Rates'!$P24*Base_Rates!$B$9)+('Case-Mix_Rates'!$P24*Base_Rates!$B$11))*ROUND($P$32*$P$35,3)","v":73.371399999999994}]
[null,null,5,{"$f":"+D37+7","v":42},{"$f":"+E37+7","v":48},0.92,null,null,null,null,"PBC1",{"$f":"IF($D$9=\"Urban\",('Case-Mix_Rates'!$O25*Base_Rates!$B$9)+('Case-Mix_Rates'!$O25*Base_Rates!$B$11),('Case-Mix_Rates'!$P25*Base_Rates!$B$9)+('Case-Mix_Rates'!$P25*Base_Rates!$B$11))*ROUND($P$32*$P$35,3)","v":116.77419999999998}]
[null,null,6,{"$f":"+D38+7","v":49},{"$f":"+E38+7","v":55},0.9,null,null,null,null,"PA1",{"$f":"IF($D$9=\"Urban\",('Case-Mix_Rates'!$O26*Base_Rates!$B$9)+('Case-Mix_Rates'!$O26*Base_Rates!$B$11),('Case-Mix_Rates'!$P26*Base_Rates!$B$9)+('Case-Mix_Rates'!$P26*Base_Rates!$B$11))*ROUND($P$32*$P$35,3)","v":68.204400000000007}]
[null,null,null,null,null,null,null,null,null,null,null,null,{"$f":"\"\"","v":""}]
[]
[null,null,"Source: CMS-1737-F, Medicare Program: Prospective Payment System and Consolidated Billing for Skilled Nursing Facilities; Updates to the Value-Based Purchasing Program for Federal Fiscal Year 2021"]
[]
[]
[null,null,"CLA’s rate listing and calculator are based on the final rule published July 31, 2020. CLA will monitor and update rates as necessary in the event of any technical corrections that result in rate changes. This calculator is intended to be informational in nature. You should consult with a professional advisor familiar with your particular factual situation for advice or service concerning any specific matters or to address your organization’s specific reimbursement rate needs."]
[null,null,"See also the \"Disclaimer\" and \"Limitation of Liability\" provisions at www.CLAconnect.com/disclaimers"]
[null,null,"© 2020 CliftonLarsonAllen LLP All Rights Reserved",null,null,null,null,null,null,null,null,null,null,null,null,"www.CLAconnect.com "]

{"sheet":"Alpha_Crosswalk","index":1,"n_rows":27,"n_cols":2,"rows_kept":27,"cut":false,"hidden":true,"merged":[]}
["Numeric","Alphabet"]
[1,"A"]
[2,"B"]
[3,"C"]
[4,"D"]
[5,"E"]
[6,"F"]
[7,"G"]
[8,"H"]
[9,"I"]
[10,"J"]
[11,"K"]
[12,"L"]
[13,"M"]
[14,"N"]
[15,"O"]
[16,"P"]
[17,"Q"]
[18,"R"]
[19,"S"]
[20,"T"]
[21,"U"]
[22,"V"]
[23,"W"]
[24,"X"]
[25,"Y"]
[26,"Z"]

{"sheet":"Base_Rates","index":2,"n_rows":27,"n_cols":7,"rows_kept":27,"cut":false,"hidden":true,"merged":[]}
[]
[null,"Nursing Case-Mix","NTA Case-Mix","PT Case-Mix","OT Case-Mix","SLP Case-Mix","Non-Case-Mix"]
["Urban",108.16,81.599999999999994,62.04,57.75,23.16,96.85]
["Rural",103.34,77.959999999999994,70.72,64.95,29.18,98.64]
["Note: Numbers come from Table 3 and Table 4 of FY 2021 final rule"]
[]
["Labor-Related",0.71299999999999997,"Table 7"]
["Wage Index",{"$f":"IFERROR(VALUE('FY 2021 SNF PDPM Rates'!D11),1)","v":1}]
["Labor Adjustment",{"$f":"+B7*B8","v":0.71299999999999997}]
[]
["Non-Labor Related",{"$f":"1-B7","v":0.28700000000000003}]
[]
[]
[]
[]
[]
[]
[]
[]
[]
[]
[null,"Nursing Case-Mix","NTA Case-Mix","PT Case-Mix","OT Case-Mix","SLP Case-Mix","Non-Case-Mix"]
["Urban",105.92,79.91,60.75,56.55,22.68,94.84]
["Rural",101.2,76.34,69.25,63.6,28.57,96.59]
["Note: Numbers come from Table 3 and Table 4 of FY 2020 final rule"]
[]
["Labor-Related",0.70899999999999996]

{"sheet":"Case-Mix_Rates","index":3,"n_rows":27,"n_cols":20,"rows_kept":27,"cut":false,"hidden":true,"merged":[]}
["HIPPS_Code","PT/OT","PT CMI","PT Urban","PT Rural","OT CMI","OT Urban","OT Rural","SLP","SLP CMI","SLP Urban","SLP Rural","Nursing","Nursing CMI","Nursing Rate Urban","Nursing Rate Rural","NTA","NTA CMI","NTA Urban","NTA Rural"]
["A","TA",{"$f":"VLOOKUP($B2,PT!$C$6:$D$21,2,FALSE)","v":1.53},{"$f":"$C2*Base_Rates!$D$3","v":94.921199999999999},{"$f":"$C2*Base_Rates!$D$4","v":108.2016},{"$f":"VLOOKUP($B2,OT!$C$6:$D$21,2,FALSE)","v":1.49},{"$f":"$F2*Base_Rates!$E$3","v":86.047499999999999},{"$f":"$F2*Base_Rates!$E$4","v":96.775500000000008},"SA",{"$f":"VLOOKUP($I2,SLP!$C$6:$D$21,2,FALSE)","v":0.68},{"$f":"$J2*Base_Rates!$F$3","v":15.748800000000001},{"$f":"$J2*Base_Rates!$F$4","v":19.842400000000001},"ES3",{"$f":"VLOOKUP($M2,Nursing!$A$6:$C$36,3,FALSE)","v":4.0599999999999996},{"$f":"$N2*Base_Rates!$B$3","v":439.12959999999993},{"$f":"$N2*Base_Rates!$B$4","v":419.56039999999996},"NA",{"$f":"VLOOKUP($Q2,NTA!$B$6:$C$36,2,FALSE)","v":3.24},{"$f":"$R2*Base_Rates!$C$3","v":264.38400000000001},{"$f":"$R2*Base_Rates!$C$4","v":252.59039999999999}]
["B","TB",{"$f":"VLOOKUP($B3,PT!$C$6:$D$21,2,FALSE)","v":1.7},{"$f":"$C3*Base_Rates!$D$3","v":105.46799999999999},{"$f":"$C3*Base_Rates!$D$4","v":120.22399999999999},{"$f":"VLOOKUP($B3,OT!$C$6:$D$21,2,FALSE)","v":1.63},{"$f":"$F3*Base_Rates!$E$3","v":94.132499999999993},{"$f":"$F3*Base_Rates!$E$4","v":105.8685},"SB",{"$f":"VLOOKUP($I3,SLP!$C$6:$D$21,2,FALSE)","v":1.82},{"$f":"$J3*Base_Rates!$F$3","v":42.151200000000003},{"$f":"$J3*Base_Rates!$F$4","v":53.107599999999998},"ES2",{"$f":"VLOOKUP($M3,Nursing!$A$6:$C$36,3,FALSE)","v":3.07},{"$f":"$N3*Base_Rates!$B$3","v":332.05119999999999},{"$f":"$N3*Base_Rates!$B$4","v":317.25380000000001},"NB",{"$f":"VLOOKUP($Q3,NTA!$B$6:$C$36,2,FALSE)","v":2.5299999999999998},{"$f":"$R3*Base_Rates!$C$3","v":206.44799999999998},{"$f":"$R3*Base_Rates!$C$4","v":197.23879999999997}]
["C","TC",{"$f":"VLOOKUP($B4,PT!$C$6:$D$21,2,FALSE)","v":1.88},{"$f":"$C4*Base_Rates!$D$3","v":116.6352},{"$f":"$C4*Base_Rates!$D$4","v":132.95359999999999},{"$f":"VLOOKUP($B4,OT!$C$6:$D$21,2,FALSE)","v":1.69},{"$f":"$F4*Base_Rates!$E$3","v":97.597499999999997},{"$f":"$F4*Base_Rates!$E$4","v":109.7655},"SC",{"$f":"VLOOKUP($I4,SLP!$C$6:$D$21,2,FALSE)","v":2.67},{"$f":"$J4*Base_Rates!$F$3","v":61.837199999999996},{"$f":"$J4*Base_Rates!$F$4","v":77.910600000000002},"ES1",{"$f":"VLOOKUP($M4,Nursing!$A$6:$C$36,3,FALSE)","v":2.93},{"$f":"$N4*Base_Rates!$B$3","v":316.90879999999999},{"$f":"$N4*Base_Rates!$B$4","v":302.78620000000001},"NC",{"$f":"VLOOKUP($Q4,NTA!$B$6:$C$36,2,FALSE)","v":1.84},{"$f":"$R4*Base_Rates!$C$3","v":150.14400000000001},{"$f":"$R4*Base_Rates!$C$4","v":143.44639999999998}]
["D","TD",{"$f":"VLOOKUP($B5,PT!$C$6:$D$21,2,FALSE)","v":1.92},{"$f":"$C5*Base_Rates!$D$3","v":119.1168},{"$f":"$C5*Base_Rates!$D$4","v":135.7824},{"$f":"VLOOKUP($B5,OT!$C$6:$D$21,2,FALSE)","v":1.53},{"$f":"$F5*Base_Rates!$E$3","v":88.357500000000002},{"$f":"$F5*Base_Rates!$E$4","v":99.373500000000007},"SD",{"$f":"VLOOKUP($I5,SLP!$C$6:$D$21,2,FALSE)","v":1.46},{"$f":"$J5*Base_Rates!$F$3","v":33.813600000000001},{"$f":"$J5*Base_Rates!$F$4","v":42.602800000000002},"HDE2",{"$f":"VLOOKUP($M5,Nursing!$A$6:$C$36,3,FALSE)","v":2.4},{"$f":"$N5*Base_Rates!$B$3","v":259.584},{"$f":"$N5*Base_Rates!$B$4","v":248.01599999999999},"ND",{"$f":"VLOOKUP($Q5,NTA!$B$6:$C$36,2,FALSE)","v":1.33},{"$f":"$R5*Base_Rates!$C$3","v":108.52799999999999},{"$f":"$R5*Base_Rates!$C$4","v":103.68679999999999}]
["E","TE",{"$f":"VLOOKUP($B6,PT!$C$6:$D$21,2,FALSE)","v":1.42},{"$f":"$C6*Base_Rates!$D$3","v":88.096799999999988},{"$f":"$C6*Base_Rates!$D$4","v":100.4224},{"$f":"VLOOKUP($B6,OT!$C$6:$D$21,2,FALSE)","v":1.41},{"$f":"$F6*Base_Rates!$E$3","v":81.427499999999995},{"$f":"$F6*Base_Rates!$E$4","v":91.579499999999996},"SE",{"$f":"VLOOKUP($I6,SLP!$C$6:$D$21,2,FALSE)","v":2.34},{"$f":"$J6*Base_Rates!$F$3","v":54.194399999999995},{"$f":"$J6*Base_Rates!$F$4","v":68.281199999999998},"HDE1",{"$f":"VLOOKUP($M6,Nursing!$A$6:$C$36,3,FALSE)","v":1.99},{"$f":"$N6*Base_Rates!$B$3","v":215.23839999999998},{"$f":"$N6*Base_Rates!$B$4","v":205.64660000000001},"NE",{"$f":"VLOOKUP($Q6,NTA!$B$6:$C$36,2,FALSE)","v":0.96},{"$f":"$R6*Base_Rates!$C$3","v":78.335999999999999},{"$f":"$R6*Base_Rates!$C$4","v":74.841599999999985}]
["F","TF",{"$f":"VLOOKUP($B7,PT!$C$6:$D$21,2,FALSE)","v":1.61},{"$f":"$C7*Base_Rates!$D$3","v":99.884399999999999},{"$f":"$C7*Base_Rates!$D$4","v":113.8592},{"$f":"VLOOKUP($B7,OT!$C$6:$D$21,2,FALSE)","v":1.6},{"$f":"$F7*Base_Rates!$E$3","v":92.4},{"$f":"$F7*Base_Rates!$E$4","v":103.92000000000002},"SF",{"$f":"VLOOKUP($I7,SLP!$C$6:$D$21,2,FALSE)","v":2.98},{"$f":"$J7*Base_Rates!$F$3","v":69.016800000000003},{"$f":"$J7*Base_Rates!$F$4","v":86.956400000000002},"HBC2",{"$f":"VLOOKUP($M7,Nursing!$A$6:$C$36,3,FALSE)","v":2.2400000000000002},{"$f":"$N7*Base_Rates!$B$3","v":242.2784},{"$f":"$N7*Base_Rates!$B$4","v":231.48160000000004},"NF",{"$f":"VLOOKUP($Q7,NTA!$B$6:$C$36,2,FALSE)","v":0.72},{"$f":"$R7*Base_Rates!$C$3","v":58.751999999999995},{"$f":"$R7*Base_Rates!$C$4","v":56.131199999999993}]
["G","TG",{"$f":"VLOOKUP($B8,PT!$C$6:$D$21,2,FALSE)","v":1.67},{"$f":"$C8*Base_Rates!$D$3","v":103.60679999999999},{"$f":"$C8*Base_Rates!$D$4","v":118.10239999999999},{"$f":"VLOOKUP($B8,OT!$C$6:$D$21,2,FALSE)","v":1.64},{"$f":"$F8*Base_Rates!$E$3","v":94.71},{"$f":"$F8*Base_Rates!$E$4","v":106.518},"SG",{"$f":"VLOOKUP($I8,SLP!$C$6:$D$21,2,FALSE)","v":2.04},{"$f":"$J8*Base_Rates!$F$3","v":47.246400000000001},{"$f":"$J8*Base_Rates!$F$4","v":59.527200000000001},"HBC1",{"$f":"VLOOKUP($M8,Nursing!$A$6:$C$36,3,FALSE)","v":1.86},{"$f":"$N8*Base_Rates!$B$3","v":201.17760000000001},{"$f":"$N8*Base_Rates!$B$4","v":192.2124}]
["H","TH",{"$f":"VLOOKUP($B9,PT!$C$6:$D$21,2,FALSE)","v":1.1599999999999999},{"$f":"$C9*Base_Rates!$D$3","v":71.966399999999993},{"$f":"$C9*Base_Rates!$D$4","v":82.035199999999989},{"$f":"VLOOKUP($B9,OT!$C$6:$D$21,2,FALSE)","v":1.1499999999999999},{"$f":"$F9*Base_Rates!$E$3","v":66.412499999999994},{"$f":"$F9*Base_Rates!$E$4","v":74.692499999999995},"SH",{"$f":"VLOOKUP($I9,SLP!$C$6:$D$21,2,FALSE)","v":2.86},{"$f":"$J9*Base_Rates!$F$3","v":66.2376},{"$f":"$J9*Base_Rates!$F$4","v":83.454799999999992},"LDE2",{"$f":"VLOOKUP($M9,Nursing!$A$6:$C$36,3,FALSE)","v":2.08},{"$f":"$N9*Base_Rates!$B$3","v":224.97280000000001},{"$f":"$N9*Base_Rates!$B$4","v":214.94720000000001}]
["I","TI",{"$f":"VLOOKUP($B10,PT!$C$6:$D$21,2,FALSE)","v":1.1299999999999999},{"$f":"$C10*Base_Rates!$D$3","v":70.105199999999996},{"$f":"$C10*Base_Rates!$D$4","v":79.913599999999988},{"$f":"VLOOKUP($B10,OT!$C$6:$D$21,2,FALSE)","v":1.18},{"$f":"$F10*Base_Rates!$E$3","v":68.144999999999996},{"$f":"$F10*Base_Rates!$E$4","v":76.641000000000005},"SI",{"$f":"VLOOKUP($I10,SLP!$C$6:$D$21,2,FALSE)","v":3.53},{"$f":"$J10*Base_Rates!$F$3","v":81.754800000000003},{"$f":"$J10*Base_Rates!$F$4","v":103.00539999999999},"LDE1",{"$f":"VLOOKUP($M10,Nursing!$A$6:$C$36,3,FALSE)","v":1.73},{"$f":"$N10*Base_Rates!$B$3","v":187.11679999999998},{"$f":"$N10*Base_Rates!$B$4","v":178.7782}]
["J","TJ",{"$f":"VLOOKUP($B11,PT!$C$6:$D$21,2,FALSE)","v":1.42},{"$f":"$C11*Base_Rates!$D$3","v":88.096799999999988},{"$f":"$C11*Base_Rates!$D$4","v":100.4224},{"$f":"VLOOKUP($B11,OT!$C$6:$D$21,2,FALSE)","v":1.45},{"$f":"$F11*Base_Rates!$E$3","v":83.737499999999997},{"$f":"$F11*Base_Rates!$E$4","v":94.177499999999995},"SJ",{"$f":"VLOOKUP($I11,SLP!$C$6:$D$21,2,FALSE)","v":2.99},{"$f":"$J11*Base_Rates!$F$3","v":69.248400000000004},{"$f":"$J11*Base_Rates!$F$4","v":87.248200000000011},"LBC2",{"$f":"VLOOKUP($M11,Nursing!$A$6:$C$36,3,FALSE)","v":1.72},{"$f":"$N11*Base_Rates!$B$3","v":186.0352},{"$f":"$N11*Base_Rates!$B$4","v":177.7448}]
["K","TK",{"$f":"VLOOKUP($B12,PT!$C$6:$D$21,2,FALSE)","v":1.52},{"$f":"$C12*Base_Rates!$D$3","v":94.300799999999995},{"$f":"$C12*Base_Rates!$D$4","v":107.4944},{"$f":"VLOOKUP($B12,OT!$C$6:$D$21,2,FALSE)","v":1.54},{"$f":"$F12*Base_Rates!$E$3","v":88.935000000000002},{"$f":"$F12*Base_Rates!$E$4","v":100.02300000000001},"SK",{"$f":"VLOOKUP($I12,SLP!$C$6:$D$21,2,FALSE)","v":3.7},{"$f":"$J12*Base_Rates!$F$3","v":85.692000000000007},{"$f":"$J12*Base_Rates!$F$4","v":107.96600000000001},"LBC1",{"$f":"VLOOKUP($M12,Nursing!$A$6:$C$36,3,FALSE)","v":1.43},{"$f":"$N12*Base_Rates!$B$3","v":154.66879999999998},{"$f":"$N12*Base_Rates!$B$4","v":147.77619999999999}]
["L","TL",{"$f":"VLOOKUP($B13,PT!$C$6:$D$21,2,FALSE)","v":1.0900000000000001},{"$f":"$C13*Base_Rates!$D$3","v":67.62360000000001},{"$f":"$C13*Base_Rates!$D$4","v":77.084800000000001},{"$f":"VLOOKUP($B13,OT!$C$6:$D$21,2,FALSE)","v":1.1100000000000001},{"$f":"$F13*Base_Rates!$E$3","v":64.102500000000006},{"$f":"$F13*Base_Rates!$E$4","v":72.094500000000011},"SL",{"$f":"VLOOKUP($I13,SLP!$C$6:$D$21,2,FALSE)","v":4.21},{"$f":"$J13*Base_Rates!$F$3","v":97.503600000000006},{"$f":"$J13*Base_Rates!$F$4","v":122.84779999999999},"CDE2",{"$f":"VLOOKUP($M13,Nursing!$A$6:$C$36,3,FALSE)","v":1.87},{"$f":"$N13*Base_Rates!$B$3","v":202.25919999999999},{"$f":"$N13*Base_Rates!$B$4","v":193.24580000000003}]
["M","TM",{"$f":"VLOOKUP($B14,PT!$C$6:$D$21,2,FALSE)","v":1.27},{"$f":"$C14*Base_Rates!$D$3","v":78.790800000000004},{"$f":"$C14*Base_Rates!$D$4","v":89.814400000000006},{"$f":"VLOOKUP($B14,OT!$C$6:$D$21,2,FALSE)","v":1.3},{"$f":"$F14*Base_Rates!$E$3","v":75.075000000000003},{"$f":"$F14*Base_Rates!$E$4","v":84.435000000000002},{"$f":"\"\"","v":""},null,null,null,"CDE1",{"$f":"VLOOKUP($M14,Nursing!$A$6:$C$36,3,FALSE)","v":1.62},{"$f":"$N14*Base_Rates!$B$3","v":175.2192},{"$f":"$N14*Base_Rates!$B$4","v":167.41080000000002}]
["N","TN",{"$f":"VLOOKUP($B15,PT!$C$6:$D$21,2,FALSE)","v":1.48},{"$f":"$C15*Base_Rates!$D$3","v":91.819199999999995},{"$f":"$C15*Base_Rates!$D$4","v":104.6656},{"$f":"VLOOKUP($B15,OT!$C$6:$D$21,2,FALSE)","v":1.5},{"$f":"$F15*Base_Rates!$E$3","v":86.625},{"$f":"$F15*Base_Rates!$E$4","v":97.425000000000011},null,null,null,null,"CBC2",{"$f":"VLOOKUP($M15,Nursing!$A$6:$C$36,3,FALSE)","v":1.55},{"$f":"$N15*Base_Rates!$B$3","v":167.648},{"$f":"$N15*Base_Rates!$B$4","v":160.17700000000002}]
["O","TO",{"$f":"VLOOKUP($B16,PT!$C$6:$D$21,2,FALSE)","v":1.55},{"$f":"$C16*Base_Rates!$D$3","v":96.162000000000006},{"$f":"$C16*Base_Rates!$D$4","v":109.616},{"$f":"VLOOKUP($B16,OT!$C$6:$D$21,2,FALSE)","v":1.55},{"$f":"$F16*Base_Rates!$E$3","v":89.512500000000003},{"$f":"$F16*Base_Rates!$E$4","v":100.67250000000001},null,null,null,null,"CA2",{"$f":"VLOOKUP($M16,Nursing!$A$6:$C$36,3,FALSE)","v":1.0900000000000001},{"$f":"$N16*Base_Rates!$B$3","v":117.8944},{"$f":"$N16*Base_Rates!$B$4","v":112.64060000000001}]
["P","TP",{"$f":"VLOOKUP($B17,PT!$C$6:$D$21,2,FALSE)","v":1.08},{"$f":"$C17*Base_Rates!$D$3","v":67.003200000000007},{"$f":"$C17*Base_Rates!$D$4","v":76.377600000000001},{"$f":"VLOOKUP($B17,OT!$C$6:$D$21,2,FALSE)","v":1.0900000000000001},{"$f":"$F17*Base_Rates!$E$3","v":62.947500000000005},{"$f":"$F17*Base_Rates!$E$4","v":70.795500000000004},null,null,null,null,"CBC1",{"$f":"VLOOKUP($M17,Nursing!$A$6:$C$36,3,FALSE)","v":1.34},{"$f":"$N17*Base_Rates!$B$3","v":144.93440000000001},{"$f":"$N17*Base_Rates!$B$4","v":138.47560000000001}]
["Q",{"$f":"\"\"","v":""},null,null,null,null,null,null,null,null,null,null,"CA1",{"$f":"VLOOKUP($M18,Nursing!$A$6:$C$36,3,FALSE)","v":0.94},{"$f":"$N18*Base_Rates!$B$3","v":101.67039999999999},{"$f":"$N18*Base_Rates!$B$4","v":97.139600000000002}]
["R",null,null,null,null,null,null,null,null,null,null,null,"BAB2",{"$f":"VLOOKUP($M19,Nursing!$A$6:$C$36,3,FALSE)","v":1.04},{"$f":"$N19*Base_Rates!$B$3","v":112.4864},{"$f":"$N19*Base_Rates!$B$4","v":107.4736}]
["S",null,null,null,null,null,null,null,null,null,null,null,"BAB1",{"$f":"VLOOKUP($M20,Nursing!$A$6:$C$36,3,FALSE)","v":0.99},{"$f":"$N20*Base_Rates!$B$3","v":107.0784},{"$f":"$N20*Base_Rates!$B$4","v":102.3066}]
["T",null,null,null,null,null,null,null,null,null,null,null,"PDE2",{"$f":"VLOOKUP($M21,Nursing!$A$6:$C$36,3,FALSE)","v":1.57},{"$f":"$N21*Base_Rates!$B$3","v":169.81120000000001},{"$f":"$N21*Base_Rates!$B$4","v":162.24380000000002}]
["U",null,null,null,null,null,null,null,null,null,null,null,"PDE1",{"$f":"VLOOKUP($M22,Nursing!$A$6:$C$36,3,FALSE)","v":1.47},{"$f":"$N22*Base_Rates!$B$3","v":158.99519999999998},{"$f":"$N22*Base_Rates!$B$4","v":151.90979999999999}]
["V",null,null,null,null,null,null,null,null,null,null,null,"PBC2",{"$f":"VLOOKUP($M23,Nursing!$A$6:$C$36,3,FALSE)","v":1.22},{"$f":"$N23*Base_Rates!$B$3","v":131.95519999999999},{"$f":"$N23*Base_Rates!$B$4","v":126.0748}]
["W",null,null,null,null,null,null,null,null,null,null,null,"PA2",{"$f":"VLOOKUP($M24,Nursing!$A$6:$C$36,3,FALSE)","v":0.71},{"$f":"$N24*Base_Rates!$B$3","v":76.793599999999998},{"$f":"$N24*Base_Rates!$B$4","v":73.371399999999994}]
["X",null,null,null,null,null,null,null,null,null,null,null,"PBC1",{"$f":"VLOOKUP($M25,Nursing!$A$6:$C$36,3,FALSE)","v":1.1299999999999999},{"$f":"$N25*Base_Rates!$B$3","v":122.22079999999998},{"$f":"$N25*Base_Rates!$B$4","v":116.77419999999999}]
["Y",null,null,null,null,null,null,null,null,null,null,null,"PA1",{"$f":"VLOOKUP($M26,Nursing!$A$6:$C$36,3,FALSE)","v":0.66},{"$f":"$N26*Base_Rates!$B$3","v":71.385599999999997},{"$f":"$N26*Base_Rates!$B$4","v":68.204400000000007}]
[null,null,null,null,null,null,null,null,null,null,null,null,{"$f":"\"\"","v":""}]

{"sheet":"PT_Analysis","index":4,"n_rows":54,"n_cols":17,"rows_kept":54,"cut":false,"hidden":true,"merged":[]}
[]
[null,"PT Component"]
[null,null,null,null,null,null,null,null,null,null,null,null,null,"Function Score"]
[null,"Clinical Category","Function Score","PT Case Mix Group","Function Score Code","CMI","Rate","Marginal Risk","Per 100 Days","Per 1,000 Days","Per 2,000 Days",null,"Clinical Category","0 to 5","6 to 9","10 to 23",24]
[null,"Major Joint Replacement or Spinal Surgery","0 to 5","TA",{"$f":"RIGHT(D5,1)","v":"A"},1.53,{"$f":"VLOOKUP(D5,'Case-Mix_Rates'!$B$2:$D$17,3,FALSE)","v":94.921199999999999},{"$f":"+G6-G5","v":10.54679999999999},{"$f":"+$H5*100","v":1054.6799999999989},{"$f":"+$H5*1000","v":10546.79999999999},{"$f":"+$H5*2000","v":21093.59999999998},null,"Major Joint Replacement or Spinal Surgery",1.53,1.69,1.88,1.92]
[null,"Major Joint Replacement or Spinal Surgery","6 to 9","TB",{"$f":"RIGHT(D6,1)","v":"B"},1.69,{"$f":"VLOOKUP(D6,'Case-Mix_Rates'!$B$2:$D$17,3,FALSE)","v":105.46799999999999},{"$f":"+G7-G6","v":11.167200000000008},{"$f":"+$H6*100","v":1116.7200000000007},{"$f":"+$H6*1000","v":11167.200000000008},{"$f":"+$H6*2000","v":22334.400000000016},null,"Other Orthopedic",1.42,1.61,1.67,1.1599999999999999]
[null,"Major Joint Replacement or Spinal Surgery","10 to 23","TC",{"$f":"RIGHT(D7,1)","v":"C"},1.88,{"$f":"VLOOKUP(D7,'Case-Mix_Rates'!$B$2:$D$17,3,FALSE)","v":116.6352},{"$f":"+G8-G7","v":2.4816000000000003},{"$f":"+$H7*100","v":248.16000000000003},{"$f":"+$H7*1000","v":2481.6000000000004},4963.2000000000007,null,"Medical Management",1.1299999999999999,1.42,1.52,1.0900000000000001]
[null,"Major Joint Replacement or Spinal Surgery",24,"TD",{"$f":"RIGHT(D8,1)","v":"D"},1.92,{"$f":"VLOOKUP(D8,'Case-Mix_Rates'!$B$2:$D$17,3,FALSE)","v":119.1168},{"$f":"+G8-G8","v":0},{"$f":"+$H8*100","v":0},{"$f":"+$H8*1000","v":0},0,null,"Non-Orthopedic Surgery and Acute Neurologic",1.27,1.48,1.55,1.08]
[null,null,null,null,null,null,null,null,null,null,null,null,"Return to Provider"]
[null,"Other Orthopedic","0 to 5","TE",{"$f":"RIGHT(D10,1)","v":"E"},1.42,{"$f":"VLOOKUP(D10,'Case-Mix_Rates'!$B$2:$D$17,3,FALSE)","v":88.096799999999988},{"$f":"+G11-G10","v":11.787600000000012},{"$f":"+$H10*100","v":1178.7600000000011},{"$f":"+$H10*1000","v":11787.600000000011},{"$f":"+$H10*2000","v":23575.200000000023},null,{"$f":"\"\"","v":""}]
[null,"Other Orthopedic","6 to 9","TF",{"$f":"RIGHT(D11,1)","v":"F"},1.61,{"$f":"VLOOKUP(D11,'Case-Mix_Rates'!$B$2:$D$17,3,FALSE)","v":99.884399999999999},{"$f":"+G12-G11","v":3.7223999999999933},{"$f":"+$H11*100","v":372.23999999999933},{"$f":"+$H11*1000","v":3722.3999999999933},{"$f":"+$H11*2000","v":7444.7999999999865}]
[null,"Other Orthopedic","10 to 23","TG",{"$f":"RIGHT(D12,1)","v":"G"},1.67,{"$f":"VLOOKUP(D12,'Case-Mix_Rates'!$B$2:$D$17,3,FALSE)","v":103.60679999999999},{"$f":"+G12-G12","v":0},{"$f":"+$H12*100","v":0},{"$f":"+$H12*1000","v":0},0]
[null,"Other Orthopedic",24,"TH",{"$f":"RIGHT(D13,1)","v":"H"},1.1599999999999999,{"$f":"VLOOKUP(D13,'Case-Mix_Rates'!$B$2:$D$17,3,FALSE)","v":71.966399999999993},{"$f":"+G10-G13","v":16.130399999999995},{"$f":"+$H13*100","v":1613.0399999999995},{"$f":"+$H13*1000","v":16130.399999999994},32260.799999999988]
[]
[null,"Medical Management","0 to 5","TI",{"$f":"RIGHT(D15,1)","v":"I"},1.1299999999999999,{"$f":"VLOOKUP(D15,'Case-Mix_Rates'!$B$2:$D$17,3,FALSE)","v":70.105199999999996},{"$f":"G16-G15","v":17.991599999999991},{"$f":"+$H15*100","v":1799.1599999999992},{"$f":"+$H15*1000","v":17991.599999999991},{"$f":"+$H15*2000","v":35983.199999999983}]
[null,"Medical Management","6 to 9","TJ",{"$f":"RIGHT(D16,1)","v":"J"},1.42,{"$f":"VLOOKUP(D16,'Case-Mix_Rates'!$B$2:$D$17,3,FALSE)","v":88.096799999999988},{"$f":"G17-G16","v":6.2040000000000077},{"$f":"+$H16*100","v":620.40000000000077},{"$f":"+$H16*1000","v":6204.0000000000073},{"$f":"+$H16*2000","v":12408.000000000015}]
[null,"Medical Management","10 to 23","TK",{"$f":"RIGHT(D17,1)","v":"K"},1.52,{"$f":"VLOOKUP(D17,'Case-Mix_Rates'!$B$2:$D$17,3,FALSE)","v":94.300799999999995},{"$f":"G17-G17","v":0},{"$f":"+$H17*100","v":0},{"$f":"+$H17*1000","v":0},0]
[null,"Medical Management",24,"TL",{"$f":"RIGHT(D18,1)","v":"L"},1.0900000000000001,{"$f":"VLOOKUP(D18,'Case-Mix_Rates'!$B$2:$D$17,3,FALSE)","v":67.62360000000001},{"$f":"G15-G18","v":2.481599999999986},{"$f":"+$H18*100","v":248.1599999999986},{"$f":"+$H18*1000","v":2481.5999999999858},4963.1999999999716]
[]
[null,"Non-Orthopedic Surgery and Acute Neurologic","0 to 5","TM",{"$f":"RIGHT(D20,1)","v":"M"},1.27,{"$f":"VLOOKUP(D20,'Case-Mix_Rates'!$B$2:$D$17,3,FALSE)","v":78.790800000000004},{"$f":"+G21-G20","v":13.028399999999991},{"$f":"+$H20*100","v":1302.839999999999},{"$f":"+$H20*1000","v":13028.399999999991},{"$f":"+$H20*2000","v":26056.799999999981}]
[null,"Non-Orthopedic Surgery and Acute Neurologic","6 to 9","TN",{"$f":"RIGHT(D21,1)","v":"N"},1.48,{"$f":"VLOOKUP(D21,'Case-Mix_Rates'!$B$2:$D$17,3,FALSE)","v":91.819199999999995},{"$f":"+G22-G21","v":4.3428000000000111},{"$f":"+$H21*100","v":434.28000000000111},{"$f":"+$H21*1000","v":4342.8000000000111},{"$f":"+$H21*2000","v":8685.6000000000222}]
[null,"Non-Orthopedic Surgery and Acute Neurologic","10 to 23","TO",{"$f":"RIGHT(D22,1)","v":"O"},1.55,{"$f":"VLOOKUP(D22,'Case-Mix_Rates'!$B$2:$D$17,3,FALSE)","v":96.162000000000006},{"$f":"+G22-G22","v":0},{"$f":"+$H22*100","v":0},{"$f":"+$H22*1000","v":0},0]
[null,"Non-Orthopedic Surgery and Acute Neurologic",24,"TP",{"$f":"RIGHT(D23,1)","v":"P"},1.08,{"$f":"VLOOKUP(D23,'Case-Mix_Rates'!$B$2:$D$17,3,FALSE)","v":67.003200000000007},{"$f":"+G20-G23","v":11.787599999999998},{"$f":"+$H23*100","v":1178.7599999999998},{"$f":"+$H23*1000","v":11787.599999999999},23575.199999999997]
[]
[null,"Functional Abilities and Goals","(increasing score means increasing independence)"]
[]
[null,"Self-Care: Eating","0 to 4",null,null,"(Affects Nursing)"]
[]
[null,"Self-Care: Oral Hygiene","0 to 4",null,null,"(Therapy only)"]
[]
[null,"Self-Care: Toileting Hygiene","0 to 4",null,null,"(Affects Nursing)"]
[]
[null,"Mobility: Sit to Lying","0 to 4",null,null,"(Affects Nursing)"]
[null,"Mobility: Lying to Sitting on side of bed","(average of 2 items)"]
[]
[null,"Mobility: Sit to Stand","0 to 4",null,null,"(Affects Nursing)"]
[null,"Mobility: Chair/bed-to-chair transfer","(average of 3 items)"]
[null,"Mobility: Toilet Transfer"]
[]
[null,"Mobility: Walk 50 feet with 2 turns","0 to 4",null,null,"(Therapy only)"]
[null,"Mobility: Walk 150 feet","(average of 2 items)"]
[]
[null,"Admission Performance","Function Score"]
[{"$f":"B44&\" (Score = \"&C44&\")\"","v":"01 (Score = 0)"},"01",0]
[{"$f":"B45&\" (Score = \"&C45&\")\"","v":"02 (Score = 1)"},"02",1]
["03 (Score = 2)","03",2]
["04 (Score = 3)","04",3]
["05 (Score = 4)","05",4]
["06 (Score = 4)","06",4]
["07 (Score = 0)","07",0]
["09 (Score = 0)","09",0]
["10 (Score = 0)","10",0]
["88 (Score = 0)","88",0]
["missing (Score = 0)","missing",0]

{"sheet":"OT_Analysis","index":5,"n_rows":41,"n_cols":16,"rows_kept":41,"cut":false,"hidden":true,"merged":[]}
[]
[null,"OT Component"]
[null,null,null,null,null,null,null,null,null,null,null,null,"Function Score"]
[null,"Clinical Category","Function Score","OT Case Mix Group","CMI","Rate","Marginal Risk","Per 100 Days","Per 1,000 Days","Per 2,000 Days",null,"Clinical Category","0 to 5","6 to 9","10 to 23",24]
[null,"Major Joint Replacement or Spinal Surgery","0 to 5","TA",{"$f":"VLOOKUP(D5,'Case-Mix_Rates'!$B$2:$H$17,5,FALSE)","v":1.49},{"$f":"VLOOKUP(D5,'Case-Mix_Rates'!$B$2:$H$17,6,FALSE)","v":86.047499999999999},{"$f":"+F8-F5","v":2.3100000000000023},{"$f":"+$G5*100","v":231.00000000000023},{"$f":"+$G5*1000","v":2310.0000000000023},{"$f":"+$G5*2000","v":4620.0000000000045},null,"Major Joint Replacement or Spinal Surgery (A-D)",1.49,1.63,1.68,1.53]
[null,"Major Joint Replacement or Spinal Surgery","6 to 9","TB",{"$f":"VLOOKUP(D6,'Case-Mix_Rates'!$B$2:$H$17,5,FALSE)","v":1.63},{"$f":"VLOOKUP(D6,'Case-Mix_Rates'!$B$2:$H$17,6,FALSE)","v":94.132499999999993},{"$f":"+F7-F6","v":3.4650000000000034},{"$f":"+$G6*100","v":346.50000000000034},{"$f":"+$G6*1000","v":3465.0000000000036},{"$f":"+$G6*2000","v":6930.0000000000073},null,"Other Orthopedic (E-H)",1.41,1.59,1.64,1.1499999999999999]
[null,"Major Joint Replacement or Spinal Surgery","10 to 23","TC",{"$f":"VLOOKUP(D7,'Case-Mix_Rates'!$B$2:$H$17,5,FALSE)","v":1.69},{"$f":"VLOOKUP(D7,'Case-Mix_Rates'!$B$2:$H$17,6,FALSE)","v":97.597499999999997},{"$f":"+F7-F7","v":0},{"$f":"+$G7*100","v":0},{"$f":"+$G7*1000","v":0},0,null,"Medical Management (I-L)",1.17,1.44,1.54,1.1100000000000001]
[null,"Major Joint Replacement or Spinal Surgery",24,"TD",{"$f":"VLOOKUP(D8,'Case-Mix_Rates'!$B$2:$H$17,5,FALSE)","v":1.53},{"$f":"VLOOKUP(D8,'Case-Mix_Rates'!$B$2:$H$17,6,FALSE)","v":88.357500000000002},{"$f":"+F6-F8","v":5.7749999999999915},{"$f":"+$G8*100","v":577.49999999999909},{"$f":"+$G8*1000","v":5774.9999999999918},11549.999999999984,null,"Non-Orthopedic Surgery and Acute Neurologic (M-P)",1.3,1.49,1.55,1.0900000000000001]
[]
[null,"Other Orthopedic","0 to 5","TE",{"$f":"VLOOKUP(D10,'Case-Mix_Rates'!$B$2:$H$17,5,FALSE)","v":1.41},{"$f":"VLOOKUP(D10,'Case-Mix_Rates'!$B$2:$H$17,6,FALSE)","v":81.427499999999995},{"$f":"+F11-F10","v":10.972500000000011},{"$f":"+$G10*100","v":1097.2500000000011},{"$f":"+$G10*1000","v":10972.500000000011},{"$f":"+$G10*2000","v":21945.000000000022}]
[null,"Other Orthopedic","6 to 9","TF",{"$f":"VLOOKUP(D11,'Case-Mix_Rates'!$B$2:$H$17,5,FALSE)","v":1.6},{"$f":"VLOOKUP(D11,'Case-Mix_Rates'!$B$2:$H$17,6,FALSE)","v":92.4},{"$f":"+F12-F11","v":2.3099999999999881},{"$f":"+$G11*100","v":230.99999999999881},{"$f":"+$G11*1000","v":2309.9999999999882},{"$f":"+$G11*2000","v":4619.9999999999764}]
[null,"Other Orthopedic","10 to 23","TG",{"$f":"VLOOKUP(D12,'Case-Mix_Rates'!$B$2:$H$17,5,FALSE)","v":1.64},{"$f":"VLOOKUP(D12,'Case-Mix_Rates'!$B$2:$H$17,6,FALSE)","v":94.71},{"$f":"+F12-F12","v":0},{"$f":"+$G12*100","v":0},{"$f":"+$G12*1000","v":0},0]
[null,"Other Orthopedic",24,"TH",{"$f":"VLOOKUP(D13,'Case-Mix_Rates'!$B$2:$H$17,5,FALSE)","v":1.1499999999999999},{"$f":"VLOOKUP(D13,'Case-Mix_Rates'!$B$2:$H$17,6,FALSE)","v":66.412499999999994},{"$f":"+F10-F13","v":15.015000000000001},{"$f":"+$G13*100","v":1501.5},{"$f":"+$G13*1000","v":15015},30030]
[]
[null,"Medical Management","0 to 5","TI",{"$f":"VLOOKUP(D15,'Case-Mix_Rates'!$B$2:$H$17,5,FALSE)","v":1.18},{"$f":"VLOOKUP(D15,'Case-Mix_Rates'!$B$2:$H$17,6,FALSE)","v":68.144999999999996},{"$f":"F16-F15","v":15.592500000000001},{"$f":"+$G15*100","v":1559.25},{"$f":"+$G15*1000","v":15592.500000000002},{"$f":"+$G15*2000","v":31185.000000000004}]
[null,"Medical Management","6 to 9","TJ",{"$f":"VLOOKUP(D16,'Case-Mix_Rates'!$B$2:$H$17,5,FALSE)","v":1.45},{"$f":"VLOOKUP(D16,'Case-Mix_Rates'!$B$2:$H$17,6,FALSE)","v":83.737499999999997},{"$f":"F17-F16","v":5.1975000000000051},{"$f":"+$G16*100","v":519.75000000000045},{"$f":"+$G16*1000","v":5197.5000000000055},{"$f":"+$G16*2000","v":10395.000000000011}]
[null,"Medical Management","10 to 23","TK",{"$f":"VLOOKUP(D17,'Case-Mix_Rates'!$B$2:$H$17,5,FALSE)","v":1.54},{"$f":"VLOOKUP(D17,'Case-Mix_Rates'!$B$2:$H$17,6,FALSE)","v":88.935000000000002},{"$f":"F17-F17","v":0},{"$f":"+$G17*100","v":0},{"$f":"+$G17*1000","v":0},0]
[null,"Medical Management",24,"TL",{"$f":"VLOOKUP(D18,'Case-Mix_Rates'!$B$2:$H$17,5,FALSE)","v":1.1100000000000001},{"$f":"VLOOKUP(D18,'Case-Mix_Rates'!$B$2:$H$17,6,FALSE)","v":64.102500000000006},{"$f":"F15-F18","v":4.0424999999999898},{"$f":"+$G18*100","v":404.24999999999898},{"$f":"+$G18*1000","v":4042.49999999999},8084.99999999998]
[]
[null,"Non-Orthopedic Surgery and Acute Neurologic","0 to 5","TM",{"$f":"VLOOKUP(D20,'Case-Mix_Rates'!$B$2:$H$17,5,FALSE)","v":1.3},{"$f":"VLOOKUP(D20,'Case-Mix_Rates'!$B$2:$H$17,6,FALSE)","v":75.075000000000003},{"$f":"+F21-F20","v":11.549999999999997},{"$f":"+$G20*100","v":1154.9999999999998},{"$f":"+$G20*1000","v":11549.999999999996},{"$f":"+$G20*2000","v":23099.999999999993}]
[null,"Non-Orthopedic Surgery and Acute Neurologic","6 to 9","TN",{"$f":"VLOOKUP(D21,'Case-Mix_Rates'!$B$2:$H$17,5,FALSE)","v":1.5},{"$f":"VLOOKUP(D21,'Case-Mix_Rates'!$B$2:$H$17,6,FALSE)","v":86.625},{"$f":"+F22-F21","v":2.8875000000000028},{"$f":"+$G21*100","v":288.75000000000028},{"$f":"+$G21*1000","v":2887.5000000000027},{"$f":"+$G21*2000","v":5775.0000000000055}]
[null,"Non-Orthopedic Surgery and Acute Neurologic","10 to 23","TO",{"$f":"VLOOKUP(D22,'Case-Mix_Rates'!$B$2:$H$17,5,FALSE)","v":1.55},{"$f":"VLOOKUP(D22,'Case-Mix_Rates'!$B$2:$H$17,6,FALSE)","v":89.512500000000003},{"$f":"+F22-F22","v":0},{"$f":"+$G22*100","v":0},{"$f":"+$G22*1000","v":0},0]
[null,"Non-Orthopedic Surgery and Acute Neurologic",24,"TP",{"$f":"VLOOKUP(D23,'Case-Mix_Rates'!$B$2:$H$17,5,FALSE)","v":1.0900000000000001},{"$f":"VLOOKUP(D23,'Case-Mix_Rates'!$B$2:$H$17,6,FALSE)","v":62.947500000000005},{"$f":"+F20-F23","v":12.127499999999998},{"$f":"+$G23*100","v":1212.7499999999998},{"$f":"+$G23*1000","v":12127.499999999998},24254.999999999996]
[]
[null,"Functional Abilities and Goals","(increasing score means increasing independence)"]
[]
[null,"Self-Care: Eating","0 to 4",null,"(Affects Nursing)"]
[]
[null,"Self-Care: Oral Hygiene","0 to 4",null,"(Therapy only)"]
[]
[null,"Self-Care: Toileting Hygiene","0 to 4",null,"(Affects Nursing)"]
[]
[null,"Mobility: Sit to Lying","0 to 4",null,"(Affects Nursing)"]
[null,"Mobility: Lying to Sitting on side of bed","(average of 2 items)"]
[]
[null,"Mobility: Sit to Stand","0 to 4",null,"(Affects Nursing)"]
[null,"Mobility: Chair/bed-to-chair transfer","(average of 3 items)"]
[null,"Mobility: Toilet Transfer"]
[]
[null,"Mobility: Walk 50 feet with 2 turns","0 to 4",null,"(Therapy only)"]
[null,"Mobility: Walk 150 feet","(average of 2 items)"]

{"sheet":"SLP_Analysis","index":6,"n_rows":98,"n_cols":15,"rows_kept":98,"cut":false,"hidden":true,"merged":[]}
[]
[null,"SLP Component"]
[null,null,null,null,null,null,null,null,null,null,null,null,{"$f":"C4","v":"Mechanically Altered Diet or Swallowing Disorder"}]
[null,"Presence of Acute Neurologic Condition, SLP-Related Comorbidity, or Cognitive Impairment","Mechanically Altered Diet or Swallowing Disorder","SLP\nCase Mix Group","CMI","Rate","Marginal Risk","Per 100 Days","Per 1,000 Days","Per 2,000 Days",null,{"$f":"B4","v":"Presence of Acute Neurologic Condition, SLP-Related Comorbidity, or Cognitive Impairment"},"Neither","Either","Both"]
[null,"None","Neither","SA",{"$f":"VLOOKUP(D5,'Case-Mix_Rates'!$I$2:$K$17,2,FALSE)","v":0.68},{"$f":"VLOOKUP(D5,'Case-Mix_Rates'!$I$2:$K$17,3,FALSE)","v":15.748800000000001},{"$f":"+F6-F5","v":26.4024},{"$f":"+$G5*100","v":2640.24},{"$f":"+$G5*1000","v":26402.400000000001},{"$f":"+$G5*2000","v":52804.800000000003},null,"None",0.68,1.82,2.66]
[null,"None","Either","SB",{"$f":"VLOOKUP(D6,'Case-Mix_Rates'!$I$2:$K$17,2,FALSE)","v":1.82},{"$f":"VLOOKUP(D6,'Case-Mix_Rates'!$I$2:$K$17,3,FALSE)","v":42.151200000000003},{"$f":"+F7-F6","v":19.685999999999993},{"$f":"+$G6*100","v":1968.5999999999992},{"$f":"+$G6*1000","v":19685.999999999993},{"$f":"+$G6*2000","v":39371.999999999985},null,"Any one",1.46,2.33,2.97]
[null,"None","Both","SC",{"$f":"VLOOKUP(D7,'Case-Mix_Rates'!$I$2:$K$17,2,FALSE)","v":2.67},{"$f":"VLOOKUP(D7,'Case-Mix_Rates'!$I$2:$K$17,3,FALSE)","v":61.837199999999996},{"$f":"+F7-F7","v":0},{"$f":"+$G7*100","v":0},{"$f":"+$G7*1000","v":0},0,null,"Any two",2.04,2.85,3.51]
[null,null,null,null,null,null,null,null,null,null,null,"All three",2.98,3.69,4.1900000000000004]
[null,"Any one","Neither","SD",{"$f":"VLOOKUP(D9,'Case-Mix_Rates'!$I$2:$K$17,2,FALSE)","v":1.46},{"$f":"VLOOKUP(D9,'Case-Mix_Rates'!$I$2:$K$17,3,FALSE)","v":33.813600000000001},{"$f":"+F10-F9","v":20.380799999999994},{"$f":"+$G9*100","v":2038.0799999999995},{"$f":"+$G9*1000","v":20380.799999999992},{"$f":"+$G9*2000","v":40761.599999999984}]
[null,"Any one","Either","SE",{"$f":"VLOOKUP(D10,'Case-Mix_Rates'!$I$2:$K$17,2,FALSE)","v":2.34},{"$f":"VLOOKUP(D10,'Case-Mix_Rates'!$I$2:$K$17,3,FALSE)","v":54.194399999999995},{"$f":"+F11-F10","v":14.822400000000009},{"$f":"+$G10*100","v":1482.2400000000009},{"$f":"+$G10*1000","v":14822.400000000009},{"$f":"+$G10*2000","v":29644.800000000017}]
[null,"Any one","Both","SF",{"$f":"VLOOKUP(D11,'Case-Mix_Rates'!$I$2:$K$17,2,FALSE)","v":2.98},{"$f":"VLOOKUP(D11,'Case-Mix_Rates'!$I$2:$K$17,3,FALSE)","v":69.016800000000003},{"$f":"+F11-F11","v":0},{"$f":"+$G11*100","v":0},{"$f":"+$G11*1000","v":0},0]
[]
[null,"Any two","Neither","SG",{"$f":"VLOOKUP(D13,'Case-Mix_Rates'!$I$2:$K$17,2,FALSE)","v":2.04},{"$f":"VLOOKUP(D13,'Case-Mix_Rates'!$I$2:$K$17,3,FALSE)","v":47.246400000000001},{"$f":"+F14-F13","v":18.991199999999999},{"$f":"+$G13*100","v":1899.12},{"$f":"+$G13*1000","v":18991.2},{"$f":"+$G13*2000","v":37982.400000000001}]
[null,"Any two","Either","SH",{"$f":"VLOOKUP(D14,'Case-Mix_Rates'!$I$2:$K$17,2,FALSE)","v":2.86},{"$f":"VLOOKUP(D14,'Case-Mix_Rates'!$I$2:$K$17,3,FALSE)","v":66.2376},{"$f":"+F15-F14","v":15.517200000000003},{"$f":"+$G14*100","v":1551.7200000000003},{"$f":"+$G14*1000","v":15517.200000000003},{"$f":"+$G14*2000","v":31034.400000000005}]
[null,"Any two","Both","SI",{"$f":"VLOOKUP(D15,'Case-Mix_Rates'!$I$2:$K$17,2,FALSE)","v":3.53},{"$f":"VLOOKUP(D15,'Case-Mix_Rates'!$I$2:$K$17,3,FALSE)","v":81.754800000000003},{"$f":"+F15-F15","v":0},{"$f":"+$G15*100","v":0},{"$f":"+$G15*1000","v":0},0]
[]
[null,"All three","Neither","SJ",{"$f":"VLOOKUP(D17,'Case-Mix_Rates'!$I$2:$K$17,2,FALSE)","v":2.99},{"$f":"VLOOKUP(D17,'Case-Mix_Rates'!$I$2:$K$17,3,FALSE)","v":69.248400000000004},{"$f":"+F18-F17","v":16.443600000000004},{"$f":"+$G17*100","v":1644.3600000000004},{"$f":"+$G17*1000","v":16443.600000000002},{"$f":"+$G17*2000","v":32887.200000000004}]
[null,"All three","Either","SK",{"$f":"VLOOKUP(D18,'Case-Mix_Rates'!$I$2:$K$17,2,FALSE)","v":3.7},{"$f":"VLOOKUP(D18,'Case-Mix_Rates'!$I$2:$K$17,3,FALSE)","v":85.692000000000007},{"$f":"+F19-F18","v":11.811599999999999},{"$f":"+$G18*100","v":1181.1599999999999},{"$f":"+$G18*1000","v":11811.599999999999},{"$f":"+$G18*2000","v":23623.199999999997}]
[null,"All three","Both","SL",{"$f":"VLOOKUP(D19,'Case-Mix_Rates'!$I$2:$K$17,2,FALSE)","v":4.21},{"$f":"VLOOKUP(D19,'Case-Mix_Rates'!$I$2:$K$17,3,FALSE)","v":97.503600000000006},{"$f":"+F19-F19","v":0},{"$f":"+$G19*100","v":0},{"$f":"+$G19*1000","v":0},0]
[]
[null,"Cognitive Impairment*"]
[null,"PDPM Cognitive Level","BIMS Score","Staff Assessment Score"]
[null,"1 - Cognitively Intact","13-15",0]
[null,"2 - Mildly Impaired","8-12","1-2"]
[null,"3 - Moderately Impaired","0-7","3-4"]
[null,"4 - Severely Impaired","-","5-6"]
[null,"*Note: Residents are classified as cognitively impaired when they are assessed to be mildly, moderately, or severely impaired"]
[]
[null,"Comorbidities Included in SLP Component"]
[null,"Condition","ICD-10-CM Code","Description"]
[null,"ALS","G12.21","Amyotrophic lateral sclerosis"]
[null,"Apraxia","I69.990","Apraxia following unspecified cerebrovascular disease"]
[null,"Dysphagia","I69.991","Dysphagia following unspecified cerebrovascular disease"]
[null,"Laryngeal Cancer","C32.0","Malignant neoplasm of glottis"]
[null,"Laryngeal Cancer","C32.1","Malignant neoplasm of supraglottis"]
[null,"Laryngeal Cancer","C32.2","Malignant neoplasm of subglottis"]
[null,"Laryngeal Cancer","C32.3","Malignant neoplasm of laryngeal cartilage"]
[null,"Laryngeal Cancer","C32.8","Malignant neoplasm of other specified sites of larynx"]
[null,"Laryngeal Cancer","C32.9","Malignant neoplasm of larynx, unspecified"]
[null,"Oral Cancers","C00.0","Malignant neoplasm of external upper lip"]
[null,"Oral Cancers","C00.1","Malignant neoplasm of external lower lip"]
[null,"Oral Cancers","C00.3","Malignant neoplasm of upper lip, inner aspect"]
[null,"Oral Cancers","C00.4","Malignant neoplasm of lower lip, inner aspect"]
[null,"Oral Cancers","C00.5","Malignant neoplasm of lip, unspecified, inner aspect"]
[null,"Oral Cancers","C00.6","Malignant neoplasm of commissure of lip, unspecified"]
[null,"Oral Cancers","C00.8","Malignant neoplasm of overlapping sites of lip"]
[null,"Oral Cancers","C00.2","Malignant neoplasm of external lip, unspecified"]
[null,"Oral Cancers","C00.9","Malignant neoplasm of lip, unspecified"]
[null,"Oral Cancers","C01","Malignant neoplasm of base of tongue"]
[null,"Oral Cancers","C02.0","Malignant neoplasm of dorsal surface of tongue"]
[null,"Oral Cancers","C02.1","Malignant neoplasm of border of tongue"]
[null,"Oral Cancers","C02.2","Malignant neoplasm of ventral surface of tongue"]
[null,"Oral Cancers","C02.3","Malignant neoplasm of anterior two-thirds of tongue, part unspecified"]
[null,"Oral Cancers","C02.8","Malignant neoplasm of overlapping sites of tongue"]
[null,"Oral Cancers","C02.4","Malignant neoplasm of lingual tonsil"]
[null,"Oral Cancers","C02.8","Malignant neoplasm of overlapping sites of tongue"]
[null,"Oral Cancers","C02.9","Malignant neoplasm of tongue, unspecified"]
[null,"Oral Cancers","C03.0","Malignant neoplasm of upper gum"]
[null,"Oral Cancers","C03.1","Malignant neoplasm of lower gum"]
[null,"Oral Cancers","C03.9","Malignant neoplasm of gum, unspecified"]
[null,"Oral Cancers","C03.9","Malignant neoplasm of gum, unspecified"]
[null,"Oral Cancers","C04.0","Malignant neoplasm of anterior floor of mouth"]
[null,"Oral Cancers","C04.1","Malignant neoplasm of lateral floor of mouth"]
[null,"Oral Cancers","C04.8","Malignant neoplasm of overlapping sites of floor of mouth"]
[null,"Oral Cancers","C04.9","Malignant neoplasm of floor of mouth, unspecified"]
[null,"Oral Cancers","C09.9","Malignant neoplasm of tonsil, unspecified"]
[null,"Oral Cancers","C09.8","Malignant neoplasm of overlapping sites of tonsil"]
[null,"Oral Cancers","C09.0","Malignant neoplasm of tonsillar fossa"]
[null,"Oral Cancers","C09.1","Malignant neoplasm of tonsillar pillar (anterior) (posterior)"]
[null,"Oral Cancers","C10.0","Malignant neoplasm of vallecula"]
[null,"Oral Cancers","C10.1","Malignant neoplasm of anterior surface of epiglottis"]
[null,"Oral Cancers","C10.8","Malignant neoplasm of overlapping sites of oropharynx"]
[null,"Oral Cancers","C10.2","Malignant neoplasm of lateral wall of oropharynx"]
[null,"Oral Cancers","C10.3","Malignant neoplasm of posterior wall of oropharynx"]
[null,"Oral Cancers","C10.4","Malignant neoplasm of branchial cleft"]
[null,"Oral Cancers","C10.8","Malignant neoplasm of overlapping sites of oropharynx"]
[null,"Oral Cancers","C10.9","Malignant neoplasm of oropharynx, unspecified"]
[null,"Oral Cancers","C14.0","Malignant neoplasm of pharynx, unspecified"]
[null,"Oral Cancers","C14.2","Malignant neoplasm of waldeyer's ring"]
[null,"Oral Cancers","C14.8","Malignant neoplasm of overlapping sites of lip, oral cavity and pharynx"]
[null,"Oral Cancers","C14.8","Malignant neoplasm of overlapping sites of lip, oral cavity and pharynx"]
[null,"Oral Cancers","C06.0","Malignant neoplasm of cheek mucosa"]
[null,"Oral Cancers","C06.1","Malignant neoplasm of vestibule of mouth"]
[null,"Oral Cancers","C05.0","Malignant neoplasm of hard palate"]
[null,"Oral Cancers","C05.1","Malignant neoplasm of soft palate"]
[null,"Oral Cancers","C05.2","Malignant neoplasm of uvula"]
[null,"Oral Cancers","C05.9","Malignant neoplasm of palate, unspecified"]
[null,"Oral Cancers","C05.8","Malignant neoplasm of overlapping sites of palate"]
[null,"Oral Cancers","C06.2","Malignant neoplasm of retromolar area"]
[null,"Oral Cancers","C06.89","Malignant neoplasm of overlapping sites of other parts of mouth"]
[null,"Oral Cancers","C06.80","Malignant neoplasm of overlapping sites of unspecified parts of mouth"]
[null,"Oral Cancers","C06.9","Malignant neoplasm of mouth, unspecified"]
[null,"Speech and Language Deficits","I69.928","Other speech and language deficits following unspecified cerebrovascular disease"]
[null,"Speech and Language Deficits","I69.920","Aphasia following unspecified cerebrovascular disease"]
[null,"Speech and Language Deficits","I69.921","Dysphasia following unspecified cerebrovascular disease"]
[null,"Speech and Language Deficits","I69.922","Dysarthria following unspecified cerebrovascular disease"]
[null,"Speech and Language Deficits","I69.923","Fluency disorder following unspecified cerebrovascular disease"]
[null,"Speech and Language Deficits","I69.928","Other speech and language deficits following unspecified cerebrovascular disease"]

{"sheet":"Nursing_Analysis","index":7,"n_rows":124,"n_cols":17,"rows_kept":124,"cut":false,"hidden":true,"merged":[]}
[]
[null,"Nursing Component"]
[null,null,null,null,null,null,null,null,null,null,null,null,null,null,{"$f":"D4","v":"Function Score"}]
[null,"Nursing Category","Conditions/Services Present","Function Score","Nursing\nCase Mix Group","Function Score Code","CMI","Rate","Marginal Risk","Per 100 Days","Per 1,000 Days","Per 2,000 Days",null,"Special Care High","0-5","6-14","15-16"]
[null,"Extensive Services","Tracheostomy Care and Ventilator/Respirator","0-14","ES3",{"$f":"IF(LEN(E5)=4,MID(E5,2,2),IF(LEFT(E5,2)<>\"ES\",MID(E5,2,1),\"< 15\"))","v":"< 15"},{"$f":"VLOOKUP(E5,'Case-Mix_Rates'!$M$2:$O$35,2,FALSE)","v":4.0599999999999996},{"$f":"VLOOKUP(E5,'Case-Mix_Rates'!$M$2:$O$35,3,FALSE)","v":439.12959999999993},{"$f":"+H6-H5","v":-107.07839999999993},{"$f":"+$I5*100","v":-10707.839999999993},{"$f":"+$I5*1000","v":-107078.39999999994},{"$f":"+$I5*2000","v":-214156.79999999987},null,"Not Depressed",1.99,1.85]
[null,"Extensive Services","Tracheostomy Care or Ventilator/Respirator","0-14","ES2",{"$f":"IF(LEN(E6)=4,MID(E6,2,2),IF(LEFT(E6,2)<>\"ES\",MID(E6,2,1),\"< 15\"))","v":"< 15"},{"$f":"VLOOKUP(E6,'Case-Mix_Rates'!$M$2:$O$35,2,FALSE)","v":3.07},{"$f":"VLOOKUP(E6,'Case-Mix_Rates'!$M$2:$O$35,3,FALSE)","v":332.05119999999999},{"$f":"+H7-H6","v":-15.142400000000009},{"$f":"+$I6*100","v":-1514.2400000000009},{"$f":"+$I6*1000","v":-15142.400000000009},{"$f":"+$I6*2000","v":-30284.800000000017},null,"Depressed",2.39,2.23]
[null,"Extensive Services","Infection Isolation","0-14","ES1","< 15",{"$f":"VLOOKUP(E7,'Case-Mix_Rates'!$M$2:$O$35,2,FALSE)","v":2.93},{"$f":"VLOOKUP(E7,'Case-Mix_Rates'!$M$2:$O$35,3,FALSE)","v":316.90879999999999},{"$f":"+H7-H7","v":0},{"$f":"+$I7*100","v":0},{"$f":"+$I7*1000","v":0},0]
[null,null,null,null,null,null,null,null,null,null,null,null,null,"Special Care Low","0-5","6-14","15-16"]
[null,"Special Care High","Yes","0-5","HDE2","DE",{"$f":"VLOOKUP(E9,'Case-Mix_Rates'!$M$2:$O$35,2,FALSE)","v":2.4},{"$f":"VLOOKUP(E9,'Case-Mix_Rates'!$M$2:$O$35,3,FALSE)","v":259.584},{"$f":"+H9-H9","v":0},{"$f":"+$I9*100","v":0},{"$f":"+$I9*1000","v":0},{"$f":"+$I9*2000","v":0},null,"Not Depressed",1.72,1.43]
[null,"Special Care High","No","0-5","HDE1","DE",{"$f":"VLOOKUP(E10,'Case-Mix_Rates'!$M$2:$O$35,2,FALSE)","v":1.99},{"$f":"VLOOKUP(E10,'Case-Mix_Rates'!$M$2:$O$35,3,FALSE)","v":215.23839999999998},{"$f":"+H9-H10","v":44.345600000000019},{"$f":"+$I10*100","v":4434.5600000000022},{"$f":"+$I10*1000","v":44345.60000000002},{"$f":"+$I10*2000","v":88691.200000000041},null,"Depressed",2.0699999999999998,1.71]
[null,"Special Care High","Yes","6-14","HBC2","BC",{"$f":"VLOOKUP(E11,'Case-Mix_Rates'!$M$2:$O$35,2,FALSE)","v":2.2400000000000002},{"$f":"VLOOKUP(E11,'Case-Mix_Rates'!$M$2:$O$35,3,FALSE)","v":242.2784},{"$f":"+H9-H11","v":17.305599999999998},{"$f":"+$I11*100","v":1730.56},{"$f":"+$I11*1000","v":17305.599999999999},{"$f":"+$I11*2000","v":34611.199999999997}]
[null,"Special Care High","No","6-14","HBC1","BC",{"$f":"VLOOKUP(E12,'Case-Mix_Rates'!$M$2:$O$35,2,FALSE)","v":1.86},{"$f":"VLOOKUP(E12,'Case-Mix_Rates'!$M$2:$O$35,3,FALSE)","v":201.17760000000001},{"$f":"+H10-H12","v":14.060799999999972},{"$f":"+$I12*100","v":1406.0799999999972},{"$f":"+$I12*1000","v":14060.799999999972},28121.599999999944,null,"Clinically Complex","0-5","6-14","15-16"]
[null,null,null,null,null,null,null,null,null,null,null,null,null,"Not Depressed",1.62,1.34,0.94]
[null,"Special Care Low","Yes","0-5","LDE2","DE",{"$f":"VLOOKUP(E14,'Case-Mix_Rates'!$M$2:$O$35,2,FALSE)","v":2.08},{"$f":"VLOOKUP(E14,'Case-Mix_Rates'!$M$2:$O$35,3,FALSE)","v":224.97280000000001},{"$f":"+H14-H14","v":0},{"$f":"+$I14*100","v":0},{"$f":"+$I14*1000","v":0},{"$f":"+$I14*2000","v":0},null,"Depressed",1.86,1.54,1.08]
[null,"Special Care Low","No","0-5","LDE1","DE",{"$f":"VLOOKUP(E15,'Case-Mix_Rates'!$M$2:$O$35,2,FALSE)","v":1.73},{"$f":"VLOOKUP(E15,'Case-Mix_Rates'!$M$2:$O$35,3,FALSE)","v":187.11679999999998},{"$f":"+H14-H15","v":37.856000000000023},{"$f":"+$I15*100","v":3785.6000000000022},{"$f":"+$I15*1000","v":37856.000000000022},{"$f":"+$I15*2000","v":75712.000000000044}]
[null,"Special Care Low","Yes","6-14","LBC2","BC",{"$f":"VLOOKUP(E16,'Case-Mix_Rates'!$M$2:$O$35,2,FALSE)","v":1.72},{"$f":"VLOOKUP(E16,'Case-Mix_Rates'!$M$2:$O$35,3,FALSE)","v":186.0352},{"$f":"+H14-H16","v":38.937600000000003},{"$f":"+$I16*100","v":3893.76},{"$f":"+$I16*1000","v":38937.600000000006},{"$f":"+$I16*2000","v":77875.200000000012},null,"Behavioral Cognitive Symptoms","11-16"]
[null,"Special Care Low","No","6-14","LBC1","BC",{"$f":"VLOOKUP(E17,'Case-Mix_Rates'!$M$2:$O$35,2,FALSE)","v":1.43},{"$f":"VLOOKUP(E17,'Case-Mix_Rates'!$M$2:$O$35,3,FALSE)","v":154.66879999999998},{"$f":"+H15-H17","v":32.448000000000008},{"$f":"+$I17*100","v":3244.8000000000006},{"$f":"+$I17*1000","v":32448.000000000007},64896.000000000015,null,"0-1",0.99]
[null,null,null,null,null,null,null,null,null,null,null,null,null,"2 or More",1.04]
[null,"Clinically Complex","Yes","0-5","CDE2","DE",{"$f":"VLOOKUP(E19,'Case-Mix_Rates'!$M$2:$O$35,2,FALSE)","v":1.87},{"$f":"VLOOKUP(E19,'Case-Mix_Rates'!$M$2:$O$35,3,FALSE)","v":202.25919999999999},{"$f":"+H19-H19","v":0},{"$f":"+$I19*100","v":0},{"$f":"+$I19*1000","v":0},{"$f":"+$I19*2000","v":0}]
[null,"Clinically Complex","No","0-5","CDE1","DE",{"$f":"VLOOKUP(E20,'Case-Mix_Rates'!$M$2:$O$35,2,FALSE)","v":1.62},{"$f":"VLOOKUP(E20,'Case-Mix_Rates'!$M$2:$O$35,3,FALSE)","v":175.2192},{"$f":"+H19-H20","v":27.039999999999992},{"$f":"+$I20*100","v":2703.9999999999991},{"$f":"+$I20*1000","v":27039.999999999993},{"$f":"+$I20*2000","v":54079.999999999985},null,"Reduced Physical Function","0-5","6-14","15-16"]
[null,"Clinically Complex","Yes","6-14","CBC2","BC",{"$f":"VLOOKUP(E21,'Case-Mix_Rates'!$M$2:$O$35,2,FALSE)","v":1.55},{"$f":"VLOOKUP(E21,'Case-Mix_Rates'!$M$2:$O$35,3,FALSE)","v":167.648},{"$f":"+H19-H21","v":34.611199999999997},{"$f":"+$I21*100","v":3461.12},{"$f":"+$I21*1000","v":34611.199999999997},{"$f":"+$I21*2000","v":69222.399999999994},null,"0-1",1.47,1.1299999999999999,0.66]
[null,"Clinically Complex","No","6-14","CBC1","BC",{"$f":"VLOOKUP(E22,'Case-Mix_Rates'!$M$2:$O$35,2,FALSE)","v":1.34},{"$f":"VLOOKUP(E22,'Case-Mix_Rates'!$M$2:$O$35,3,FALSE)","v":144.93440000000001},{"$f":"+H20-H22","v":30.28479999999999},null,null,null,null,"2 or More",1.57,1.21,0.7]
[null,"Clinically Complex","Yes","15-16","CA2","A",{"$f":"VLOOKUP(E23,'Case-Mix_Rates'!$M$2:$O$35,2,FALSE)","v":1.0900000000000001},{"$f":"VLOOKUP(E23,'Case-Mix_Rates'!$M$2:$O$35,3,FALSE)","v":117.8944},{"$f":"+H21-H23","v":49.753599999999992},{"$f":"+$I23*100","v":4975.3599999999988},{"$f":"+$I23*1000","v":49753.599999999991},99507.199999999983]
[null,"Clinically Complex","No","15-16","CA1","A",{"$f":"VLOOKUP(E24,'Case-Mix_Rates'!$M$2:$O$35,2,FALSE)","v":0.94},{"$f":"VLOOKUP(E24,'Case-Mix_Rates'!$M$2:$O$35,3,FALSE)","v":101.67039999999999},{"$f":"+H22-H24","v":43.264000000000024}]
[]
[null,"Behavioral Cognitive Symptoms","2 or More","11-16","BAB2","AB",{"$f":"VLOOKUP(E26,'Case-Mix_Rates'!$M$2:$O$35,2,FALSE)","v":1.04},{"$f":"VLOOKUP(E26,'Case-Mix_Rates'!$M$2:$O$35,3,FALSE)","v":112.4864},{"$f":"+H31-H26","v":19.468799999999987},{"$f":"+$I26*100","v":1946.8799999999987},{"$f":"+$I26*1000","v":19468.799999999988},{"$f":"+$I26*2000","v":38937.599999999977}]
[null,"Behavioral Cognitive Symptoms","0-1","11-16","BAB1","AB",{"$f":"VLOOKUP(E27,'Case-Mix_Rates'!$M$2:$O$35,2,FALSE)","v":0.99},{"$f":"VLOOKUP(E27,'Case-Mix_Rates'!$M$2:$O$35,3,FALSE)","v":107.0784},{"$f":"+H32-H27","v":15.142399999999981},{"$f":"+$I27*100","v":1514.239999999998},{"$f":"+$I27*1000","v":15142.399999999981},{"$f":"+$I27*2000","v":30284.799999999963}]
[]
[null,"Reduced Physical Function","2 or More","0-5","PDE2","DE",{"$f":"VLOOKUP(E29,'Case-Mix_Rates'!$M$2:$O$35,2,FALSE)","v":1.57},{"$f":"VLOOKUP(E29,'Case-Mix_Rates'!$M$2:$O$35,3,FALSE)","v":169.81120000000001},{"$f":"+H29-H29","v":0},{"$f":"+$I29*100","v":0},{"$f":"+$I29*1000","v":0},{"$f":"+$I29*2000","v":0}]
[null,"Reduced Physical Function","0-1","0-5","PDE1","DE",{"$f":"VLOOKUP(E30,'Case-Mix_Rates'!$M$2:$O$35,2,FALSE)","v":1.47},{"$f":"VLOOKUP(E30,'Case-Mix_Rates'!$M$2:$O$35,3,FALSE)","v":158.99519999999998},{"$f":"+H29-H30","v":10.816000000000031},1081.6000000000031,10816.000000000031,21632.000000000062]
[null,"Reduced Physical Function","2 or More","6-14","PBC2","BC",{"$f":"VLOOKUP(E31,'Case-Mix_Rates'!$M$2:$O$35,2,FALSE)","v":1.22},{"$f":"VLOOKUP(E31,'Case-Mix_Rates'!$M$2:$O$35,3,FALSE)","v":131.95519999999999},{"$f":"+H29-H31","v":37.856000000000023},3785.6000000000022,37856.000000000022,75712.000000000044]
[null,"Reduced Physical Function","0-1","6-14","PBC1","BC",{"$f":"VLOOKUP(E32,'Case-Mix_Rates'!$M$2:$O$35,2,FALSE)","v":1.1299999999999999},{"$f":"VLOOKUP(E32,'Case-Mix_Rates'!$M$2:$O$35,3,FALSE)","v":122.22079999999998},{"$f":"+H30-H32","v":36.7744},3677.44,36774.400000000001,73548.800000000003]
[null,"Reduced Physical Function","2 or More","15-16","PA2","A",{"$f":"VLOOKUP(E33,'Case-Mix_Rates'!$M$2:$O$35,2,FALSE)","v":0.71},{"$f":"VLOOKUP(E33,'Case-Mix_Rates'!$M$2:$O$35,3,FALSE)","v":76.793599999999998},{"$f":"+H31-H33","v":55.161599999999993},5516.1599999999989,55161.599999999991,110323.19999999998]
[null,"Reduced Physical Function","0-1","15-16","PA1","A",{"$f":"VLOOKUP(E34,'Case-Mix_Rates'!$M$2:$O$35,2,FALSE)","v":0.66},{"$f":"VLOOKUP(E34,'Case-Mix_Rates'!$M$2:$O$35,3,FALSE)","v":71.385599999999997},{"$f":"+H32-H34","v":50.835199999999986},5083.5199999999986,50835.199999999983,101670.39999999997]
[]
[null,"Functional Abilities and Goals","(increasing score means increasing independence)"]
[]
[null,"Self-Care: Eating","0 to 4"]
[]
[null,"Self-Care: Toileting Hygiene","0 to 4"]
[]
[null,"Mobility: Sit to Lying","0 to 4"]
[null,"Mobility: Lying to Sitting on side of bed","(average of 2 items)"]
[]
[null,"Mobility: Sit to Stand","0 to 4"]
[null,"Mobility: Chair/bed-to-chair transfer","(average of 3 items)","Score is 15 or 16","Score is > 10","Score is <= 11"]
[null,"Mobility: Toilet Transfer",null,{"$f":"IF(#REF!>14,TRUE,FALSE)","v":{"$error":"#REF!"}},{"$f":"IF(#REF!>10,TRUE,FALSE)","v":{"$error":"#REF!"}},{"$f":"IF(#REF!<12,TRUE,FALSE)","v":{"$error":"#REF!"}}]
[]
[null,"Extensive Services","(Nursing Function Score < 15)",null,{"$f":"IF(AND(#REF!>0,LEFT(#REF!,3)<>\"N/A\"),TRUE,FALSE)","v":{"$error":"#REF!"}},null,{"$f":"IF(E49,B49,\"\")","v":{"$error":"#REF!"}}]
[{"$f":"B50&\" - \"&C50","v":"O0100E2 - Tracheostomy Care and Ventilator/Respirator"},"O0100E2","Tracheostomy Care and Ventilator/Respirator",{"$f":"IF($D$47,\"N/A - Function Score > 14\",B50&\" - \"&C50)","v":{"$error":"#REF!"}},null,{"$f":"IF(#REF!=A50,TRUE,FALSE)","v":{"$error":"#REF!"}},null,{"$f":"IF($F50,C50,\"\")","v":{"$error":"#REF!"}},{"$f":"IF($F50,\"Yes\",\"\")","v":{"$error":"#REF!"}},{"$f":"IF($F50,\"0-14\",\"\")","v":{"$error":"#REF!"}}]
[{"$f":"B51&\" - \"&C51","v":"O0100F2 - Tracheostomy Care or Ventilator/Respirator"},"O0100F2","Tracheostomy Care or Ventilator/Respirator",{"$f":"IF($D$47,\"\",B51&\" - \"&C51)","v":{"$error":"#REF!"}},null,{"$f":"IF(#REF!=A51,TRUE,FALSE)","v":{"$error":"#REF!"}},null,{"$f":"IF($F51,C51,\"\")","v":{"$error":"#REF!"}},{"$f":"IF($F51,\"Yes\",\"\")","v":{"$error":"#REF!"}},{"$f":"IF($F51,\"0-14\",\"\")","v":{"$error":"#REF!"}}]
["O0100M2 - Infection Isolation","O0100M2","Infection Isolation",{"$f":"IF($D$47,\"\",B52&\" - \"&C52)","v":{"$error":"#REF!"}},null,{"$f":"IF(#REF!=A52,TRUE,FALSE)","v":{"$error":"#REF!"}},null,{"$f":"IF($F52,C52,\"\")","v":{"$error":"#REF!"}},{"$f":"IF($F52,\"Yes\",\"\")","v":{"$error":"#REF!"}},{"$f":"IF($F52,\"0-14\",\"\")","v":{"$error":"#REF!"}}]
[null,null,"N/A",{"$f":"IF($D$47,\"\",C53)","v":{"$error":"#REF!"}}]
[]
[null,"Depression",null,null,{"$f":"IF((D60+E81)=1,TRUE,FALSE)","v":{"$error":"#REF!"}},null,null,{"$f":"IF(E55,\"Depressed\",\"\")","v":{"$error":"#REF!"}},null,{"$f":"IF($E55,INDEX(Nursing!$H$39:$J$41,MATCH(#REF!,Nursing!$J$39:$J$41,1),1),\"\")","v":{"$error":"#REF!"}}]
[null,"D0300 or D0600","Total Severity Score >= 10 but not 99",{"$f":"IF($E$55,C56,\"N/A\")","v":{"$error":"#REF!"}},null,{"$f":"IF(#REF!=C56,TRUE,FALSE)","v":{"$error":"#REF!"}},null,null,{"$f":"IF($E$55,IF($F$56,\"Yes\",\"No\"),\"\")","v":{"$error":"#REF!"}}]
[null,null,null,{"$f":"IF($E$55,\"Total Severity Score < 10 or is 99\",\"\")","v":{"$error":"#REF!"}}]
[]
[null,null,null,"Special Care","High","Low"]
[null,"Special Care","(Nursing Function Score < 15)",{"$f":"OR(E60,F60)","v":{"$error":"#REF!"}},{"$f":"IF((F61+F62+F63+F65+F68+F70+F71+F78)=1,TRUE,FALSE)","v":{"$error":"#REF!"}},{"$f":"IF((F64+F66+F67+F69+F72+F73+F74+F75+F76+F77)=1,TRUE,FALSE)","v":{"$error":"#REF!"}},{"$f":"IF(E60,B60&\" High\",IF(F60,B60&\" Low\",\"\"))","v":{"$error":"#REF!"}}]
["H","B0100 Comatose","GG0130A1, GG0130C1, GG0170B1, GG0170C1, GG017D1, GG0170E1, and GG0170F1, all equal 01, 09, or 88",{"$f":"IF($D$47,\"N/A - Function Score > 14\",B61)","v":{"$error":"#REF!"}},{"$f":"IF(#REF!=D61,TRUE,FALSE)","v":{"$error":"#REF!"}},{"$f":"IF(AND(E61,#REF!=$O$61),TRUE,FALSE)","v":{"$error":"#REF!"}},null,null,null,null,null,null,null,null,{"$f":"IFERROR(INDEX($C$61:$E$78,MATCH(TRUE,$E$61:$E$78,0),1),\"N/A\")","v":"N/A"}]
["H","I2100 Septicemia","N/A",{"$f":"IF($D$47,\"\",B62)","v":{"$error":"#REF!"}},{"$f":"IF(#REF!=D62,TRUE,FALSE)","v":{"$error":"#REF!"}},{"$f":"IF(AND(E62,#REF!=$O$61),TRUE,FALSE)","v":{"$error":"#REF!"}},null,null,null,null,null,null,null,null,{"$f":"IF(OR(O61=\"N/A\",AND(O61=\"Function score <= 11\",TRUE)),\"\",\"Does not qualify - skip to clinically complex\")","v":""}]
["H","I2900 Diabetes","Insulin injections (N0350A) for all 7 days and Insulin order changes on 2 or more days (N0350B)",{"$error":"#REF!"},{"$f":"IF(#REF!=D63,TRUE,FALSE)","v":{"$error":"#REF!"}},{"$f":"IF(AND(E63,#REF!=$O$61),TRUE,FALSE)","v":{"$error":"#REF!"}}]
["L","I4400 Cerebral palsy","Function score <= 11",{"$error":"#REF!"},{"$f":"IF(#REF!=D64,TRUE,FALSE)","v":{"$error":"#REF!"}},{"$f":"IF(AND(E64,$F$47,#REF!=$O$61),TRUE,FALSE)","v":{"$error":"#REF!"}}]
["H","I5100 Quadriplegia","Function score <= 11",{"$error":"#REF!"},{"$f":"IF(#REF!=D65,TRUE,FALSE)","v":{"$error":"#REF!"}},{"$f":"IF(AND(E65,$F$47,#REF!=$O$61),TRUE,FALSE)","v":{"$error":"#REF!"}}]
["L","I5200 Multiple sclerosis","Function score <= 11",{"$error":"#REF!"},{"$f":"IF(#REF!=D66,TRUE,FALSE)","v":{"$error":"#REF!"}},{"$f":"IF(AND(E66,$F$47,#REF!=$O$61),TRUE,FALSE)","v":{"$error":"#REF!"}}]
["L","I5300 Parkinson's disease","Function score <= 11",{"$error":"#REF!"},{"$f":"IF(#REF!=D67,TRUE,FALSE)","v":{"$error":"#REF!"}},{"$f":"IF(AND(E67,$F$47,#REF!=$O$61),TRUE,FALSE)","v":{"$error":"#REF!"}}]
["H","I6200 Chronic obstructive pulmonday disease & JJ1100C Shortness of breath when lying flat",null,{"$error":"#REF!"},{"$f":"IF(#REF!=D68,TRUE,FALSE)","v":{"$error":"#REF!"}},{"$f":"IF(AND(E68,#REF!=$O$61),TRUE,FALSE)","v":{"$error":"#REF!"}}]
["L","I6300 Respiratory failure & O0100C2 Oxygen therapy while a resident",null,{"$f":"IF($D$47,\"N/A - Function Score > 14\",B69)","v":{"$error":"#REF!"}},{"$f":"IF(#REF!=D69,TRUE,FALSE)","v":{"$error":"#REF!"}},{"$f":"IF(AND(E69,#REF!=$O$61),TRUE,FALSE)","v":{"$error":"#REF!"}}]
["H","J1550A Fever","One of pneumonia, vomiting, weight loss, or feeding tube (feeding tube meets classification requirements)",{"$f":"IF($D$47,\"\",B70)","v":{"$error":"#REF!"}},{"$f":"IF(#REF!=D70,TRUE,FALSE)","v":{"$error":"#REF!"}},{"$f":"IF(AND(E70,#REF!=$O$61),TRUE,FALSE)","v":{"$error":"#REF!"}}]
["H","K0510A1 | K0510A2 Parenteral/IV feedings",null,{"$error":"#REF!"},{"$f":"IF(#REF!=D71,TRUE,FALSE)","v":{"$error":"#REF!"}},{"$f":"IF(AND(E71,#REF!=$O$61),TRUE,FALSE)","v":{"$error":"#REF!"}}]
["L","K0510B1 | K0510B2 Feeding tube","K0710A3 is 51% or more of total calories OR is 26% to 50% AND K0710B3 is 501 cc or more per day in last 7 days",{"$error":"#REF!"},{"$f":"IF(#REF!=D72,TRUE,FALSE)","v":{"$error":"#REF!"}},{"$f":"IF(AND(E72,#REF!=$O$61),TRUE,FALSE)","v":{"$error":"#REF!"}}]
["L","M0300B1 Stage 2 pressure ulcer","Two or more stage 2 pressure ulcers with two or more selected skin treatments [M1200(A, B, C, D, E, G, or H)]",{"$error":"#REF!"},{"$f":"IF(#REF!=D73,TRUE,FALSE)","v":{"$error":"#REF!"}},{"$f":"IF(AND(E73,#REF!=$O$61),TRUE,FALSE)","v":{"$error":"#REF!"}}]
["L","M0300B1 Stage 2 pressure ulcer & M1030 Venous/arterial ulcer","Two or more selected skin treatments: M1200(A, B, C, D, E, G, or H)",{"$error":"#REF!"},{"$f":"IF(#REF!=D74,TRUE,FALSE)","v":{"$error":"#REF!"}},{"$f":"IF(AND(E74,#REF!=$O$61),TRUE,FALSE)","v":{"$error":"#REF!"}}]
["L","M1040A,B,C; M1200I Foot infection, diabetic foot ulcer or other open lesion of foot with application of dressings to the feet",null,{"$error":"#REF!"},{"$f":"IF(#REF!=D75,TRUE,FALSE)","v":{"$error":"#REF!"}},{"$f":"IF(AND(E75,#REF!=$O$61),TRUE,FALSE)","v":{"$error":"#REF!"}}]
["L","O0100B2 Radiation treatment while a resident",null,{"$error":"#REF!"},{"$f":"IF(#REF!=D76,TRUE,FALSE)","v":{"$error":"#REF!"}},{"$f":"IF(AND(E76,#REF!=$O$61),TRUE,FALSE)","v":{"$error":"#REF!"}}]
["L","O0100J2 Dialysis treatment while a resident",null,{"$error":"#REF!"},{"$f":"IF(#REF!=D77,TRUE,FALSE)","v":{"$error":"#REF!"}},{"$f":"IF(AND(E77,#REF!=$O$61),TRUE,FALSE)","v":{"$error":"#REF!"}}]
["H","O0400D2 Respiratory therapy for all 7 days",null,{"$error":"#REF!"},{"$f":"IF(#REF!=D78,TRUE,FALSE)","v":{"$error":"#REF!"}},{"$f":"IF(AND(E78,#REF!=$O$61),TRUE,FALSE)","v":{"$error":"#REF!"}}]
[null,null,"N/A",{"$f":"IF($D$47,\"\",C79)","v":{"$error":"#REF!"}}]
[]
[null,"Clinically Complex",null,null,{"$f":"IF(AND(#REF!>0,LEFT(#REF!,3)<>\"N/A\"),TRUE,FALSE)","v":{"$error":"#REF!"}},{"$f":"IF((F82+F83+F84+F85+F86+F87+F88+F89)=1,TRUE,FALSE)","v":{"$error":"#REF!"}},{"$f":"IF(E81,B81,\"\")","v":{"$error":"#REF!"}}]
[{"$f":"B82&\" - \"&C82","v":"I2000 - Pneumonia"},"I2000","Pneumonia",{"$f":"B82&\" - \"&C82","v":"I2000 - Pneumonia"},null,{"$f":"IF(#REF!=A82,TRUE,FALSE)","v":{"$error":"#REF!"}}]
["I4900, Nursing Function Score - Hemiplegia/hemiparesis with Nursing Function Score <= 11","I4900, Nursing Function Score","Hemiplegia/hemiparesis with Nursing Function Score <= 11",{"$f":"IF(#REF!>11,\"\",B83&\" - \"&C83)","v":{"$error":"#REF!"}},null,{"$f":"IF(#REF!=A83,TRUE,FALSE)","v":{"$error":"#REF!"}}]
["M1040D,E - Open lesions (other than ulcers, rashes, and cuts) with any selected skin treatment or surgical wounds","M1040D,E","Open lesions (other than ulcers, rashes, and cuts) with any selected skin treatment or surgical wounds",{"$f":"B84&\" - \"&C84","v":"M1040D,E - Open lesions (other than ulcers, rashes, and cuts) with any selected skin treatment or surgical wounds"},null,{"$f":"IF(#REF!=A84,TRUE,FALSE)","v":{"$error":"#REF!"}}]
["M1040F - Burns","M1040F","Burns","M1040F - Burns",null,{"$f":"IF(#REF!=A85,TRUE,FALSE)","v":{"$error":"#REF!"}}]
["O0100A2 - Chemotherapy while a resident","O0100A2","Chemotherapy while a resident","O0100A2 - Chemotherapy while a resident",null,{"$f":"IF(#REF!=A86,TRUE,FALSE)","v":{"$error":"#REF!"}}]
["O0100C2 - Oxygen Therapy while a resident","O0100C2","Oxygen Therapy while a resident","O0100C2 - Oxygen Therapy while a resident",null,{"$f":"IF(#REF!=A87,TRUE,FALSE)","v":{"$error":"#REF!"}}]
["O0100H2 - IV Medications while a resident","O0100H2","IV Medications while a resident","O0100H2 - IV Medications while a resident",null,{"$f":"IF(#REF!=A88,TRUE,FALSE)","v":{"$error":"#REF!"}}]
["O0100I2 - Transfusions while a resident","O0100I2","Transfusions while a resident","O0100I2 - Transfusions while a resident",null,{"$f":"IF(#REF!=A89,TRUE,FALSE)","v":{"$error":"#REF!"}}]
[null,null,"N/A",{"$f":"C90","v":"N/A"}]
[]
[null,"Behavioral Symptoms and Cognitive Performance","(Nursing Function Score > 10)",{"$f":"AND(E92,F92)","v":{"$error":"#REF!"}},{"$f":"IF(AND((E49+D60+E81)=0,E47),TRUE,FALSE)","v":{"$error":"#REF!"}},{"$f":"F99","v":{"$error":"#REF!"}},{"$f":"IF(D92,\"Behavioral Cognitive Symptoms\",\"\")","v":{"$error":"#REF!"}},{"$f":"IF(OR($E92,$E$109),\"Restorative Nursing Services\",\"\")","v":{"$error":"#REF!"}},{"$f":"IF(D92,IF(F109=2,C26,C27),\"\")","v":{"$error":"#REF!"}},{"$f":"IF($F92,\"11-16\",\"\")","v":{"$error":"#REF!"}}]
[null,"Cognitive Assessment",null,{"$f":"IF($E$92,\"BIMS\",\"N/A\")","v":{"$error":"#REF!"}},{"$f":"IF($E$92,\"Staff Assessment\",\"\")","v":{"$error":"#REF!"}}]
[{"$f":"B94&\" - \"&C94","v":"C0500 - BIMS Summary Score <= 9"},"C0500","BIMS Summary Score <= 9",{"$f":"IF(AND($E$47,$E$92),B94&\" - \"&C94,\"N/A\")","v":{"$error":"#REF!"}},{"$f":"IF($E$47,B94&\" | \"&\"BIMS Summary Score >= 9\",\"\")","v":{"$error":"#REF!"}},{"$f":"IF(#REF!=A94,TRUE,FALSE)","v":{"$error":"#REF!"}}]
[{"$f":"B95&\" - \"&C95","v":"B0100 - Coma and completely dependent or activity did not occur at admission"},"B0100","Coma and completely dependent or activity did not occur at admission",{"$f":"IF(AND($E$47,$E$92),B95&\" - \"&C95,\"\")","v":{"$error":"#REF!"}},null,{"$f":"IF(#REF!=A95,TRUE,FALSE)","v":{"$error":"#REF!"}}]
["C1000 - Severely impaired cognitive skills for daily decision making","C1000","Severely impaired cognitive skills for daily decision making",{"$f":"IF(AND($E$47,$E$92),B96&\" - \"&C96,\"\")","v":{"$error":"#REF!"}},null,{"$f":"IF(#REF!=A96,TRUE,FALSE)","v":{"$error":"#REF!"}}]
["B0700, C0700, C1000 - Two or more impairment indicators present and one or more severe impairment indicators are present","B0700, C0700, C1000","Two or more impairment indicators present and one or more severe impairment indicators are present",{"$f":"IF(AND($E$47,$E$92),B97&\" - \"&C97,\"\")","v":{"$error":"#REF!"}},null,{"$f":"IF(#REF!=A97,TRUE,FALSE)","v":{"$error":"#REF!"}}]
[null,null,"N/A",{"$f":"IF(AND($E$47,$E$92),C98,\"\")","v":{"$error":"#REF!"}}]
[null,"Behavioral Symptoms",null,null,null,{"$f":"IF((F94+F95+F96+F97)=1,TRUE,FALSE)","v":{"$error":"#REF!"}}]
[{"$f":"B100&\" - \"&C100","v":"E0100A - Hallucinations"},"E0100A","Hallucinations",{"$f":"IF(AND($E$47,$F$99),B100&\" - \"&C100,\"N/A\")","v":{"$error":"#REF!"}}]
["E0100B - Delusions","E0100B","Delusions",{"$f":"IF(AND($E$47,$F$99),B101&\" - \"&C101,\"\")","v":{"$error":"#REF!"}}]
["E0200A - Physical behavioral symptoms directed toward others (2 or 3)","E0200A","Physical behavioral symptoms directed toward others (2 or 3)",{"$error":"#REF!"}]
["E0200B - Verbal behavioral symptoms directed toward others (2 or 3)","E0200B","Verbal behavioral symptoms directed toward others (2 or 3)",{"$error":"#REF!"}]
["E0200C - Other behavioral symptons not directed toward others (2 or 3)","E0200C","Other behavioral symptons not directed toward others (2 or 3)",{"$error":"#REF!"}]
["E0800 - Rejection of care (2 or 3)","E0800","Rejection of care (2 or 3)",{"$error":"#REF!"}]
["E0900 - Wandering (2 or 3)","E0900","Wandering (2 or 3)",{"$error":"#REF!"}]
[null,null,"N/A",{"$f":"IF(AND($E$47,F99),C107,\"\")","v":{"$error":"#REF!"}}]
[]
[null,"Reduced Physical Function",null,null,{"$f":"IF((E49+D60+E81+F99)=0,TRUE,FALSE)","v":{"$error":"#REF!"}},{"$f":"F110+F111+F112+F113+F114+F115+F116+F117+F118","v":{"$error":"#REF!"}},{"$f":"IF(E109,B109,\"\")","v":{"$error":"#REF!"}},null,{"$f":"IF(E109,IF(F109=2,C26,C27),\"\")","v":{"$error":"#REF!"}},{"$f":"IF($E109,INDEX(Nursing!$H$39:$J$41,MATCH(#REF!,Nursing!$J$39:$J$41,1),1),\"\")","v":{"$error":"#REF!"}}]
[{"$f":"B110&\" - \"&C110","v":"H0200C, H0500 - Urinary toileting program and/or bowel toileting program"},"H0200C, H0500","Urinary toileting program and/or bowel toileting program",{"$f":"IF($E$109,B110&\" - \"&C110,\"N/A\")","v":{"$error":"#REF!"}},null,{"$f":"IF(OR(#REF!=A110,#REF!=A110),TRUE,FALSE)","v":{"$error":"#REF!"}}]
["O0500A,B - Passive and/or active range or motion","O0500A,B","Passive and/or active range or motion",{"$f":"IF($E$109,B111&\" - \"&C111,\"\")","v":{"$error":"#REF!"}},null,{"$f":"IF(OR(#REF!=A111,#REF!=A111),TRUE,FALSE)","v":{"$error":"#REF!"}}]
["O0500C - Splint or brace assistance","O0500C","Splint or brace assistance",{"$f":"IF($E$109,B112&\" - \"&C112,\"\")","v":{"$error":"#REF!"}},null,{"$f":"IF(OR(#REF!=A112,#REF!=A112),TRUE,FALSE)","v":{"$error":"#REF!"}}]
["O0500D,F - Bed mobility and/or walking training","O0500D,F","Bed mobility and/or walking training",{"$error":"#REF!"},null,{"$f":"IF(OR(#REF!=A113,#REF!=A113),TRUE,FALSE)","v":{"$error":"#REF!"}}]
["O0500E - Transfer training","O0500E","Transfer training",{"$error":"#REF!"},null,{"$f":"IF(OR(#REF!=A114,#REF!=A114),TRUE,FALSE)","v":{"$error":"#REF!"}}]
["O0500G - Dressing and/or grooming training","O0500G","Dressing and/or grooming training",{"$error":"#REF!"},null,{"$f":"IF(OR(#REF!=A115,#REF!=A115),TRUE,FALSE)","v":{"$error":"#REF!"}}]
["O0500H - Eating and/or swallowing training","O0500H","Eating and/or swallowing training",{"$error":"#REF!"},null,{"$f":"IF(OR(#REF!=A116,#REF!=A116),TRUE,FALSE)","v":{"$error":"#REF!"}}]
["O0500I - Amputation/prostheses care","O0500I","Amputation/prostheses care",{"$error":"#REF!"},null,{"$f":"IF(OR(#REF!=A117,#REF!=A117),TRUE,FALSE)","v":{"$error":"#REF!"}}]
["O0500J - Communication training","O0500J","Communication training",{"$error":"#REF!"},null,{"$f":"IF(OR(#REF!=A118,#REF!=A118),TRUE,FALSE)","v":{"$error":"#REF!"}}]
["N/A"]
[]
[null,"Category",null,null,null,null,{"$f":"G49&G60&G81&G92&G109","v":{"$error":"#REF!"}}]
[null,"Conditions/Services",null,null,null,null,null,{"$f":"H50&H51&H52&H55&H92","v":{"$error":"#REF!"}}]
[null,"Conditions/Services Present",null,null,null,null,null,null,{"$f":"I50&I51&I52&I56&I92&I109","v":{"$error":"#REF!"}}]
[null,"Function Score",null,null,null,null,null,null,null,{"$f":"J50&J51&J52&J55&J92&J109","v":{"$error":"#REF!"}}]

{"sheet":"NTA_Analysis","index":8,"n_rows":63,"n_cols":14,"rows_kept":63,"cut":false,"hidden":true,"merged":[]}
[]
[null,"NTA Component"]
[]
[null,"NTA Comorbidity Score","NTA\nCase Mix Group","CMI","Rate","Marginal Risk","Per 100 Days","Per 1,000 Days","Per 2,000 Days",null,"Avg. Risk per Point","Avg. Rate per Point"]
[null,"12+","NA",{"$f":"VLOOKUP(C5,'Case-Mix_Rates'!$Q$2:$S$17,2,FALSE)","v":3.24},{"$f":"VLOOKUP(C5,'Case-Mix_Rates'!$Q$2:$S$17,3,FALSE)","v":264.38400000000001},{"$f":"+E5-E6","v":57.936000000000035},{"$f":"+$F5*100","v":5793.600000000004},{"$f":"+$F5*1000","v":57936.000000000036},{"$f":"+$F5*2000","v":115872.00000000007},null,{"$f":"F5","v":57.936000000000035},{"$f":"E5/12","v":22.032}]
[null,"9-11","NB",{"$f":"VLOOKUP(C6,'Case-Mix_Rates'!$Q$2:$S$17,2,FALSE)","v":2.5299999999999998},{"$f":"VLOOKUP(C6,'Case-Mix_Rates'!$Q$2:$S$17,3,FALSE)","v":206.44799999999998},{"$f":"+E5-E6","v":57.936000000000035},5793.600000000004,57936.000000000036,{"$f":"+$F6*2000","v":115872.00000000007},null,{"$f":"F6/3","v":19.312000000000012},{"$f":"E6/10","v":20.644799999999996}]
[null,"6-8","NC",{"$f":"VLOOKUP(C7,'Case-Mix_Rates'!$Q$2:$S$17,2,FALSE)","v":1.84},{"$f":"VLOOKUP(C7,'Case-Mix_Rates'!$Q$2:$S$17,3,FALSE)","v":150.14400000000001},{"$f":"+E6-E7","v":56.303999999999974},5630.3999999999978,56303.999999999971,112607.99999999994,null,{"$f":"F7/3","v":18.76799999999999},{"$f":"E7/7","v":21.449142857142856}]
[null,"3-5","ND",{"$f":"VLOOKUP(C8,'Case-Mix_Rates'!$Q$2:$S$17,2,FALSE)","v":1.33},{"$f":"VLOOKUP(C8,'Case-Mix_Rates'!$Q$2:$S$17,3,FALSE)","v":108.52799999999999},{"$f":"+E7-E8","v":41.616000000000014},4161.6000000000013,41616.000000000015,{"$f":"+$F8*2000","v":83232.000000000029},null,{"$f":"F8/3","v":13.872000000000005},{"$f":"E8/4","v":27.131999999999998}]
[null,"1-2","NE",{"$f":"VLOOKUP(C9,'Case-Mix_Rates'!$Q$2:$S$17,2,FALSE)","v":0.96},{"$f":"VLOOKUP(C9,'Case-Mix_Rates'!$Q$2:$S$17,3,FALSE)","v":78.335999999999999},{"$f":"+E8-E9","v":30.191999999999993},3019.1999999999994,30191.999999999993,{"$f":"+$F9*2000","v":60383.999999999985},null,{"$f":"F9/2","v":15.095999999999997},{"$f":"E9/2","v":39.167999999999999}]
[null,0,"NF",{"$f":"VLOOKUP(C10,'Case-Mix_Rates'!$Q$2:$S$17,2,FALSE)","v":0.72},{"$f":"VLOOKUP(C10,'Case-Mix_Rates'!$Q$2:$S$17,3,FALSE)","v":58.751999999999995},{"$f":"+E9-E10","v":19.584000000000003},1958.4000000000003,19584.000000000004,39168.000000000007]
[]
[null,"Comorbidities Included in NTA Comorbidity Score and Assigned Points"]
[null,"Condition/Extensive Service","MDS Item","Points",null,"Points",1,2,3,4,5,7,8,"Total"]
[{"$f":"C14&\" - \"&B14&\" (\"&D14&\" points)\"","v":"H0100C  - Bladder and Bowel Appliances: Ostomy  (1 points)"},"Bladder and Bowel Appliances: Ostomy ","H0100C ",1,null,"Count",{"$f":"COUNTIF($D$14:$D$63,G$13)","v":35},{"$f":"COUNTIF($D$14:$D$63,H$13)","v":9},2,1,1,1,1,{"$f":"SUM(G14:M14)","v":50}]
[{"$f":"C15&\" - \"&B15&\" (\"&D15&\" points)\"","v":"H0100D  - Bladder and Bowel Appliances: Intermittent catheterization  (1 points)"},"Bladder and Bowel Appliances: Intermittent catheterization ","H0100D ",1,null,"Sum",{"$f":"G14*G13","v":35},{"$f":"H14*H13","v":18},6,4,5,7,8,{"$f":"SUM(G15:M15)","v":83}]
["I1700  - Active Diagnoses: Multi-Drug Resistant Organism (MDRO) Code  (1 points)","Active Diagnoses: Multi-Drug Resistant Organism (MDRO) Code ","I1700 ",1,null,"Minimum","NE","NE","ND","ND","ND","NC","NC"]
["I2500  - Wound Infection Code  (2 points)","Wound Infection Code ","I2500 ",2]
["I2900  - Active Diagnoses: Diabetes Mellitus (DM) Code  (2 points)","Active Diagnoses: Diabetes Mellitus (DM) Code ","I2900 ",2]
["I5200  - Active Diagnoses: Multiple Sclerosis Code  (2 points)","Active Diagnoses: Multiple Sclerosis Code ","I5200 ",2]
["I5600  - Active Diagnoses: Malnutrition Code  (1 points)","Active Diagnoses: Malnutrition Code ","I5600 ",1]
["I6200  - Active Diagnoses: Asthma  COPD  Chronic Lung Disease Code  (2 points)","Active Diagnoses: Asthma  COPD  Chronic Lung Disease Code ","I6200 ",2]
["I8000 - Aseptic Necrosis of Bone  (1 points)","Aseptic Necrosis of Bone ","I8000",1]
["I8000 - Bone/Joint/Muscle Infections/Necrosis - Except: Aseptic Necrosis of Bone  (2 points)","Bone/Joint/Muscle Infections/Necrosis - Except: Aseptic Necrosis of Bone ","I8000",2]
["I8000 - Cardio-Respiratory Failure and Shock  (1 points)","Cardio-Respiratory Failure and Shock ","I8000",1]
["I8000 - Chronic Myeloid Leukemia  (2 points)","Chronic Myeloid Leukemia ","I8000",2]
["I8000 - Chronic Pancreatitis  (1 points)","Chronic Pancreatitis ","I8000",1]
["I8000 - Cirrhosis of Liver  (1 points)","Cirrhosis of Liver ","I8000",1]
["I8000 - Complications of Specified Implanted Device or Graft  (1 points)","Complications of Specified Implanted Device or Graft ","I8000",1]
["I8000 - Cystic Fibrosis  (1 points)","Cystic Fibrosis ","I8000",1]
["I8000 - Diabetic Retinopathy - Except : Proliferative Diabetic Retinopathy and Vitreous Hemorrhage  (1 points)","Diabetic Retinopathy - Except : Proliferative Diabetic Retinopathy and Vitreous Hemorrhage ","I8000",1]
["I8000 - Disorders of Immunity - Except : RxCC97: Immune Disorders  (1 points)","Disorders of Immunity - Except : RxCC97: Immune Disorders ","I8000",1]
["I8000 - Endocarditis  (1 points)","Endocarditis ","I8000",1]
["I8000 - End-Stage Liver Disease  (1 points)","End-Stage Liver Disease ","I8000",1]
["I8000 - Immune Disorders  (1 points)","Immune Disorders ","I8000",1]
["I8000 - Inflammatory Bowel Disease  (1 points)","Inflammatory Bowel Disease ","I8000",1]
["I8000 - Intractable Epilepsy  (1 points)","Intractable Epilepsy ","I8000",1]
["I8000 - Lung Transplant Status  (3 points)","Lung Transplant Status ","I8000",3]
["I8000 - Major Organ Transplant Status, Except Lung  (2 points)","Major Organ Transplant Status, Except Lung ","I8000",2]
["I8000 - Morbid Obesity  (1 points)","Morbid Obesity ","I8000",1]
["I8000 - Myelodysplastic Syndromes and Myelofibrosis  (1 points)","Myelodysplastic Syndromes and Myelofibrosis ","I8000",1]
["I8000 - Narcolepsy and Cataplexy  (1 points)","Narcolepsy and Cataplexy ","I8000",1]
["I8000 - Opportunistic Infections  (2 points)","Opportunistic Infections ","I8000",2]
["I8000 - Proliferative Diabetic Retinopathy and Vitreous Hemorrhage  (1 points)","Proliferative Diabetic Retinopathy and Vitreous Hemorrhage ","I8000",1]
["I8000 - Psoriatic Arthropathy and Systemic Sclerosis  (1 points)","Psoriatic Arthropathy and Systemic Sclerosis ","I8000",1]
["I8000 - Pulmonary Fibrosis and Other Chronic Lung Disorders  (1 points)","Pulmonary Fibrosis and Other Chronic Lung Disorders ","I8000",1]
["I8000 - Respiratory Arrest  (1 points)","Respiratory Arrest ","I8000",1]
["I8000 - Severe Skin Burn or Condition  (1 points)","Severe Skin Burn or Condition ","I8000",1]
["I8000 - Specified Hereditary Metabolic/Immune Disorders  (1 points)","Specified Hereditary Metabolic/Immune Disorders ","I8000",1]
["I8000 - Systemic Lupus Erythematosus, Other Connective Tissue Disorders, and Inflammatory Spondylopathies  (1 points)","Systemic Lupus Erythematosus, Other Connective Tissue Disorders, and Inflammatory Spondylopathies ","I8000",1]
["K0510A2  K0710A2 - Parenteral IV Feeding: Level High  (7 points)","Parenteral IV Feeding: Level High ","K0510A2  K0710A2",7]
["K0510A2  K0710A2  K0710B2 - Parenteral IV feeding: Level Low (3 points)","Parenteral IV feeding: Level Low","K0510A2  K0710A2  K0710B2",3]
["K0510B2  - Nutritional Approaches While a Resident: Feeding Tube  (1 points)","Nutritional Approaches While a Resident: Feeding Tube ","K0510B2 ",1]
["M0300X1  - Highest Stage of Unhealed Pressure Ulcer - Stage 4  (1 points)","Highest Stage of Unhealed Pressure Ulcer - Stage 4 ","M0300X1 ",1]
["M1040A  M1040B  M1040C   - Other Foot Skin Problems: Foot Infection Code, Other Open Lesion on Foot Code, Except Diabetic Foot Ulcer Code  (1 points)","Other Foot Skin Problems: Foot Infection Code, Other Open Lesion on Foot Code, Except Diabetic Foot Ulcer Code ","M1040A  M1040B  M1040C  ",1]
["M1040B  - Other Foot Skin Problems: Diabetic Foot Ulcer Code  (1 points)","Other Foot Skin Problems: Diabetic Foot Ulcer Code ","M1040B ",1]
["O0100B2  - Special Treatments/Programs: Radiation Post-admit Code  (1 points)","Special Treatments/Programs: Radiation Post-admit Code ","O0100B2 ",1]
["O0100D2  - Special Treatments/Programs: Suctioning Post-admit Code  (1 points)","Special Treatments/Programs: Suctioning Post-admit Code ","O0100D2 ",1]
["O0100E2  - Special Treatments/Programs: Tracheostomy Post-admit Code  (1 points)","Special Treatments/Programs: Tracheostomy Post-admit Code ","O0100E2 ",1]
["O0100F2  - Special Treatments/Programs: Ventilator Post-admit Code  (4 points)","Special Treatments/Programs: Ventilator Post-admit Code ","O0100F2 ",4]
["O0100H2  - Special Treatments/Programs: Intravenous Medication Post-admit Code  (5 points)","Special Treatments/Programs: Intravenous Medication Post-admit Code ","O0100H2 ",5]
["O0100I2  - Special Treatments/Programs: Transfusion Post-admit Code  (2 points)","Special Treatments/Programs: Transfusion Post-admit Code ","O0100I2 ",2]
["O0100M2  - Special Treatments/Programs: Isolation Post-admit Code  (1 points)","Special Treatments/Programs: Isolation Post-admit Code ","O0100M2 ",1]
["SNF Claim ICD-10 B20 - HIV/AIDS  (8 points)","HIV/AIDS ","SNF Claim ICD-10 B20",8]

{"sheet":"Case-Mix_Descriptions","index":9,"n_rows":63,"n_cols":4,"rows_kept":63,"cut":false,"hidden":true,"merged":[]}
[]
[null,"TA",{"$f":"PT!$A$5&\": \"&PT!A6&\"|\"&PT!$B$5&\": \"&PT!B6","v":"Clinical Category: Major Joint Replacement or Spinal Surgery|Function Score: 0-5"},{"$f":"PT!$A$5&\": \"&#REF!&\"|\"&PT!$B$5&\": \"&INDEX(PT!B6:E9,MATCH(#REF!,PT!E6:E9,1),1)","v":{"$error":"#REF!"}}]
[null,"TB",{"$f":"PT!$A$5&\": \"&PT!A7&\"|\"&PT!$B$5&\": \"&PT!B7","v":"Clinical Category: Major Joint Replacement or Spinal Surgery|Function Score: 6-9"},{"$f":"INDEX(B2:C17,MATCH(D2,C2:C17,0),1)","v":{"$error":"#REF!"}}]
[null,"TC",{"$f":"PT!$A$5&\": \"&PT!A8&\"|\"&PT!$B$5&\": \"&PT!B8","v":"Clinical Category: Major Joint Replacement or Spinal Surgery|Function Score: 10-23"}]
[null,"TD",{"$f":"PT!$A$5&\": \"&PT!A9&\"|\"&PT!$B$5&\": \"&PT!B9","v":"Clinical Category: Major Joint Replacement or Spinal Surgery|Function Score: 24"}]
[null,"TE",{"$f":"PT!$A$5&\": \"&PT!A10&\"|\"&PT!$B$5&\": \"&PT!B10","v":"Clinical Category: Other Orthopedic|Function Score: 0-5"}]
[null,"TF",{"$f":"PT!$A$5&\": \"&PT!A11&\"|\"&PT!$B$5&\": \"&PT!B11","v":"Clinical Category: Other Orthopedic|Function Score: 6-9"}]
[null,"TG",{"$f":"PT!$A$5&\": \"&PT!A12&\"|\"&PT!$B$5&\": \"&PT!B12","v":"Clinical Category: Other Orthopedic|Function Score: 10-23"}]
[null,"TH",{"$f":"PT!$A$5&\": \"&PT!A13&\"|\"&PT!$B$5&\": \"&PT!B13","v":"Clinical Category: Other Orthopedic|Function Score: 24"}]
[null,"TI",{"$f":"PT!$A$5&\": \"&PT!A14&\"|\"&PT!$B$5&\": \"&PT!B14","v":"Clinical Category: Medical Management|Function Score: 0-5"}]
[null,"TJ",{"$f":"PT!$A$5&\": \"&PT!A15&\"|\"&PT!$B$5&\": \"&PT!B15","v":"Clinical Category: Medical Management|Function Score: 6-9"}]
[null,"TK",{"$f":"PT!$A$5&\": \"&PT!A16&\"|\"&PT!$B$5&\": \"&PT!B16","v":"Clinical Category: Medical Management|Function Score: 10-23"}]
[null,"TL",{"$f":"PT!$A$5&\": \"&PT!A17&\"|\"&PT!$B$5&\": \"&PT!B17","v":"Clinical Category: Medical Management|Function Score: 24"}]
[null,"TM",{"$f":"PT!$A$5&\": \"&PT!A18&\"|\"&PT!$B$5&\": \"&PT!B18","v":"Clinical Category: Non-Orthopedic Surgery and Acute Neurologic|Function Score: 0-5"}]
[null,"TN",{"$f":"PT!$A$5&\": \"&PT!A19&\"|\"&PT!$B$5&\": \"&PT!B19","v":"Clinical Category: Non-Orthopedic Surgery and Acute Neurologic|Function Score: 6-9"}]
[null,"TO",{"$f":"PT!$A$5&\": \"&PT!A20&\"|\"&PT!$B$5&\": \"&PT!B20","v":"Clinical Category: Non-Orthopedic Surgery and Acute Neurologic|Function Score: 10-23"}]
[null,"TP",{"$f":"PT!$A$5&\": \"&PT!A21&\"|\"&PT!$B$5&\": \"&PT!B21","v":"Clinical Category: Non-Orthopedic Surgery and Acute Neurologic|Function Score: 24"}]
[]
[null,"SA",{"$f":"SLP!$A$5&\": \"&SLP!A6&\"|\"&SLP!$B$5&\": \"&SLP!B6","v":"Presence of Acute Neurologic Condition, SLP-Related Comorbidity, or Cognitive Impairment: None|Mechanically Altered Diet or Swallowing Disorder: Neither"},{"$f":"SLP!$A$5&\": \"&#REF!&\"|\"&SLP!$B$5&\": \"&#REF!","v":{"$error":"#REF!"}}]
[null,"SB",{"$f":"SLP!$A$5&\": \"&SLP!A7&\"|\"&SLP!$B$5&\": \"&SLP!B7","v":"Presence of Acute Neurologic Condition, SLP-Related Comorbidity, or Cognitive Impairment: None|Mechanically Altered Diet or Swallowing Disorder: Either"},{"$f":"INDEX(B19:C30,MATCH(D19,C19:C30,0),1)","v":{"$error":"#REF!"}}]
[null,"SC",{"$f":"SLP!$A$5&\": \"&SLP!A8&\"|\"&SLP!$B$5&\": \"&SLP!B8","v":"Presence of Acute Neurologic Condition, SLP-Related Comorbidity, or Cognitive Impairment: None|Mechanically Altered Diet or Swallowing Disorder: Both"}]
[null,"SD",{"$f":"SLP!$A$5&\": \"&SLP!A9&\"|\"&SLP!$B$5&\": \"&SLP!B9","v":"Presence of Acute Neurologic Condition, SLP-Related Comorbidity, or Cognitive Impairment: Any one|Mechanically Altered Diet or Swallowing Disorder: Neither"}]
[null,"SE",{"$f":"SLP!$A$5&\": \"&SLP!A10&\"|\"&SLP!$B$5&\": \"&SLP!B10","v":"Presence of Acute Neurologic Condition, SLP-Related Comorbidity, or Cognitive Impairment: Any one|Mechanically Altered Diet or Swallowing Disorder: Either"}]
[null,"SF",{"$f":"SLP!$A$5&\": \"&SLP!A11&\"|\"&SLP!$B$5&\": \"&SLP!B11","v":"Presence of Acute Neurologic Condition, SLP-Related Comorbidity, or Cognitive Impairment: Any one|Mechanically Altered Diet or Swallowing Disorder: Both"}]
[null,"SG",{"$f":"SLP!$A$5&\": \"&SLP!A12&\"|\"&SLP!$B$5&\": \"&SLP!B12","v":"Presence of Acute Neurologic Condition, SLP-Related Comorbidity, or Cognitive Impairment: Any two|Mechanically Altered Diet or Swallowing Disorder: Neither"}]
[null,"SH",{"$f":"SLP!$A$5&\": \"&SLP!A13&\"|\"&SLP!$B$5&\": \"&SLP!B13","v":"Presence of Acute Neurologic Condition, SLP-Related Comorbidity, or Cognitive Impairment: Any two|Mechanically Altered Diet or Swallowing Disorder: Either"}]
[null,"SI",{"$f":"SLP!$A$5&\": \"&SLP!A14&\"|\"&SLP!$B$5&\": \"&SLP!B14","v":"Presence of Acute Neurologic Condition, SLP-Related Comorbidity, or Cognitive Impairment: Any two|Mechanically Altered Diet or Swallowing Disorder: Both"}]
[null,"SJ",{"$f":"SLP!$A$5&\": \"&SLP!A15&\"|\"&SLP!$B$5&\": \"&SLP!B15","v":"Presence of Acute Neurologic Condition, SLP-Related Comorbidity, or Cognitive Impairment: All three|Mechanically Altered Diet or Swallowing Disorder: Neither"}]
[null,"SK",{"$f":"SLP!$A$5&\": \"&SLP!A16&\"|\"&SLP!$B$5&\": \"&SLP!B16","v":"Presence of Acute Neurologic Condition, SLP-Related Comorbidity, or Cognitive Impairment: All three|Mechanically Altered Diet or Swallowing Disorder: Either"}]
[null,"SL",{"$f":"SLP!$A$5&\": \"&SLP!A17&\"|\"&SLP!$B$5&\": \"&SLP!B17","v":"Presence of Acute Neurologic Condition, SLP-Related Comorbidity, or Cognitive Impairment: All three|Mechanically Altered Diet or Swallowing Disorder: Both"}]
[]
[null,"ES3",{"$f":"Nursing_Analysis!B$121&\": \"&Nursing!E19&\" | \"&Nursing!$F$18&\": \"&Nursing!F19&\"|\"&Nursing!$G$18&\": \"&Nursing!G19&\"|\"&Nursing!$H$18&\": \"&Nursing!H19","v":"Category: Extensive Services | Conditions/Services: Tracheostomy Care and Ventilator/Respirator|Conditions/Services Present: Yes|Section GG-Based Function Score: 0-14"},{"$f":"Nursing_Analysis!B$121&\": \"&Nursing_Analysis!$G$121&\" | \"&Nursing!$F$18&\": \"&Nursing_Analysis!H122&\"|\"&Nursing!$G$18&\": \"&Nursing_Analysis!$I$123&\"|\"&Nursing!$H$18&\": \"&Nursing_Analysis!$J$124","v":{"$error":"#REF!"}}]
[null,"ES2",{"$f":"Nursing_Analysis!B$121&\": \"&Nursing!E20&\" | \"&Nursing!$F$18&\": \"&Nursing!F20&\"|\"&Nursing!$G$18&\": \"&Nursing!G20&\"|\"&Nursing!$H$18&\": \"&Nursing!H20","v":"Category: Extensive Services | Conditions/Services: Tracheostomy Care or Ventilator/Respirator|Conditions/Services Present: Yes|Section GG-Based Function Score: 0-14"},{"$f":"INDEX(B32:C56,MATCH(D32,C32:C56,0),1)","v":{"$error":"#REF!"}}]
[null,"ES1",{"$f":"Nursing_Analysis!B$121&\": \"&Nursing!E21&\" | \"&Nursing!$F$18&\": \"&Nursing!F21&\"|\"&Nursing!$G$18&\": \"&Nursing!G21&\"|\"&Nursing!$H$18&\": \"&Nursing!H21","v":"Category: Extensive Services | Conditions/Services: Infection Isolation|Conditions/Services Present: Yes|Section GG-Based Function Score: 0-14"}]
[null,"HDE2",{"$f":"Nursing_Analysis!B$121&\": \"&Nursing!E22&\" | \"&Nursing!$F$18&\": \"&Nursing!F22&\"|\"&Nursing!$G$18&\": \"&Nursing!G22&\"|\"&Nursing!$H$18&\": \"&Nursing!H22","v":"Category: Special Care High | Conditions/Services: Depressed|Conditions/Services Present: Yes|Section GG-Based Function Score: 0-5"}]
[null,"HDE1",{"$f":"Nursing_Analysis!B$121&\": \"&Nursing!E23&\" | \"&Nursing!$F$18&\": \"&Nursing!F23&\"|\"&Nursing!$G$18&\": \"&Nursing!G23&\"|\"&Nursing!$H$18&\": \"&Nursing!H23","v":"Category: Special Care High | Conditions/Services: Depressed|Conditions/Services Present: No|Section GG-Based Function Score: 0-5"}]
[null,"HBC2",{"$f":"Nursing_Analysis!B$121&\": \"&Nursing!E24&\" | \"&Nursing!$F$18&\": \"&Nursing!F24&\"|\"&Nursing!$G$18&\": \"&Nursing!G24&\"|\"&Nursing!$H$18&\": \"&Nursing!H24","v":"Category: Special Care High | Conditions/Services: Depressed|Conditions/Services Present: Yes|Section GG-Based Function Score: 6-14"}]
[null,"HBC1",{"$f":"Nursing_Analysis!B$121&\": \"&Nursing!E25&\" | \"&Nursing!$F$18&\": \"&Nursing!F25&\"|\"&Nursing!$G$18&\": \"&Nursing!G25&\"|\"&Nursing!$H$18&\": \"&Nursing!H25","v":"Category: Special Care High | Conditions/Services: Depressed|Conditions/Services Present: No|Section GG-Based Function Score: 6-14"}]
[null,"LDE2",{"$f":"Nursing_Analysis!B$121&\": \"&Nursing!E26&\" | \"&Nursing!$F$18&\": \"&Nursing!F26&\"|\"&Nursing!$G$18&\": \"&Nursing!G26&\"|\"&Nursing!$H$18&\": \"&Nursing!H26","v":"Category: Special Care Low | Conditions/Services: Depressed|Conditions/Services Present: Yes|Section GG-Based Function Score: 0-5"}]
[null,"LDE1",{"$f":"Nursing_Analysis!B$121&\": \"&Nursing!E27&\" | \"&Nursing!$F$18&\": \"&Nursing!F27&\"|\"&Nursing!$G$18&\": \"&Nursing!G27&\"|\"&Nursing!$H$18&\": \"&Nursing!H27","v":"Category: Special Care Low | Conditions/Services: Depressed|Conditions/Services Present: No|Section GG-Based Function Score: 0-5"}]
[null,"LBC2",{"$f":"Nursing_Analysis!B$121&\": \"&Nursing!E28&\" | \"&Nursing!$F$18&\": \"&Nursing!F28&\"|\"&Nursing!$G$18&\": \"&Nursing!G28&\"|\"&Nursing!$H$18&\": \"&Nursing!H28","v":"Category: Special Care Low | Conditions/Services: Depressed|Conditions/Services Present: Yes|Section GG-Based Function Score: 6-14"}]
[null,"LBC1",{"$f":"Nursing_Analysis!B$121&\": \"&Nursing!E29&\" | \"&Nursing!$F$18&\": \"&Nursing!F29&\"|\"&Nursing!$G$18&\": \"&Nursing!G29&\"|\"&Nursing!$H$18&\": \"&Nursing!H29","v":"Category: Special Care Low | Conditions/Services: Depressed|Conditions/Services Present: No|Section GG-Based Function Score: 6-14"}]
[null,"CDE2",{"$f":"Nursing_Analysis!B$121&\": \"&Nursing!E30&\" | \"&Nursing!$F$18&\": \"&Nursing!F30&\"|\"&Nursing!$G$18&\": \"&Nursing!G30&\"|\"&Nursing!$H$18&\": \"&Nursing!H30","v":"Category: Clinically Complex | Conditions/Services: Depressed|Conditions/Services Present: Yes|Section GG-Based Function Score: 0-5"}]
[null,"CDE1",{"$f":"Nursing_Analysis!B$121&\": \"&Nursing!E31&\" | \"&Nursing!$F$18&\": \"&Nursing!F31&\"|\"&Nursing!$G$18&\": \"&Nursing!G31&\"|\"&Nursing!$H$18&\": \"&Nursing!H31","v":"Category: Clinically Complex | Conditions/Services: Depressed|Conditions/Services Present: No|Section GG-Based Function Score: 0-5"}]
[null,"CBC2",{"$f":"Nursing_Analysis!B$121&\": \"&Nursing!E32&\" | \"&Nursing!$F$18&\": \"&Nursing!F32&\"|\"&Nursing!$G$18&\": \"&Nursing!G32&\"|\"&Nursing!$H$18&\": \"&Nursing!H32","v":"Category: Clinically Complex | Conditions/Services: Depressed|Conditions/Services Present: Yes|Section GG-Based Function Score: 6-14"}]
[null,"CA2",{"$f":"Nursing_Analysis!B$121&\": \"&Nursing!E33&\" | \"&Nursing!$F$18&\": \"&Nursing!F33&\"|\"&Nursing!$G$18&\": \"&Nursing!G33&\"|\"&Nursing!$H$18&\": \"&Nursing!H33","v":"Category: Clinically Complex | Conditions/Services: Depressed|Conditions/Services Present: Yes|Section GG-Based Function Score: 15-16"}]
[null,"CBC1",{"$f":"Nursing_Analysis!B$121&\": \"&Nursing!E34&\" | \"&Nursing!$F$18&\": \"&Nursing!F34&\"|\"&Nursing!$G$18&\": \"&Nursing!G34&\"|\"&Nursing!$H$18&\": \"&Nursing!H34","v":"Category: Clinically Complex | Conditions/Services: Depressed|Conditions/Services Present: No|Section GG-Based Function Score: 6-14"}]
[null,"CA1",{"$f":"Nursing_Analysis!B$121&\": \"&Nursing!E35&\" | \"&Nursing!$F$18&\": \"&Nursing!F35&\"|\"&Nursing!$G$18&\": \"&Nursing!G35&\"|\"&Nursing!$H$18&\": \"&Nursing!H35","v":"Category: Clinically Complex | Conditions/Services: Depressed|Conditions/Services Present: No|Section GG-Based Function Score: 15-16"}]
[null,"BAB2",{"$f":"Nursing_Analysis!B$121&\": \"&Nursing!E36&\" | \"&Nursing!$F$18&\": \"&Nursing!F36&\"|\"&Nursing!$G$18&\": \"&Nursing!G36&\"|\"&Nursing!$H$18&\": \"&Nursing!H36","v":"Category: Behavioral Cognitive Symptoms | Conditions/Services: Restorative Nursing Services|Conditions/Services Present: 2 or More|Section GG-Based Function Score: 11-16"}]
[null,"BAB1",{"$f":"Nursing_Analysis!B$121&\": \"&Nursing!E37&\" | \"&Nursing!$F$18&\": \"&Nursing!F37&\"|\"&Nursing!$G$18&\": \"&Nursing!G37&\"|\"&Nursing!$H$18&\": \"&Nursing!H37","v":"Category: Behavioral Cognitive Symptoms | Conditions/Services: Restorative Nursing Services|Conditions/Services Present: 0-1|Section GG-Based Function Score: 11-16"}]
[null,"PDE2",{"$f":"Nursing_Analysis!B$121&\": \"&Nursing!E38&\" | \"&Nursing!$F$18&\": \"&Nursing!F38&\"|\"&Nursing!$G$18&\": \"&Nursing!G38&\"|\"&Nursing!$H$18&\": \"&Nursing!H38","v":"Category: Reduced Physical Function | Conditions/Services: Restorative Nursing Services|Conditions/Services Present: 2 or More|Section GG-Based Function Score: 0-5"}]
[null,"PDE1",{"$f":"Nursing_Analysis!B$121&\": \"&Nursing!E39&\" | \"&Nursing!$F$18&\": \"&Nursing!F39&\"|\"&Nursing!$G$18&\": \"&Nursing!G39&\"|\"&Nursing!$H$18&\": \"&Nursing!H39","v":"Category: Reduced Physical Function | Conditions/Services: Restorative Nursing Services|Conditions/Services Present: 0-1|Section GG-Based Function Score: 0-5"}]
[null,"PBC2",{"$f":"Nursing_Analysis!B$121&\": \"&Nursing!E40&\" | \"&Nursing!$F$18&\": \"&Nursing!F40&\"|\"&Nursing!$G$18&\": \"&Nursing!G40&\"|\"&Nursing!$H$18&\": \"&Nursing!H40","v":"Category: Reduced Physical Function | Conditions/Services: Restorative Nursing Services|Conditions/Services Present: 2 or More|Section GG-Based Function Score: 6-14"}]
[null,"PA2",{"$f":"Nursing_Analysis!B$121&\": \"&Nursing!E41&\" | \"&Nursing!$F$18&\": \"&Nursing!F41&\"|\"&Nursing!$G$18&\": \"&Nursing!G41&\"|\"&Nursing!$H$18&\": \"&Nursing!H41","v":"Category: Reduced Physical Function | Conditions/Services: Restorative Nursing Services|Conditions/Services Present: 2 or More|Section GG-Based Function Score: 15-16"}]
[null,"PBC1",{"$f":"Nursing_Analysis!B$121&\": \"&Nursing!E42&\" | \"&Nursing!$F$18&\": \"&Nursing!F42&\"|\"&Nursing!$G$18&\": \"&Nursing!G42&\"|\"&Nursing!$H$18&\": \"&Nursing!H42","v":"Category: Reduced Physical Function | Conditions/Services: Restorative Nursing Services|Conditions/Services Present: 0-1|Section GG-Based Function Score: 6-14"}]
[null,"PA1",{"$f":"Nursing_Analysis!B$121&\": \"&Nursing!E43&\" | \"&Nursing!$F$18&\": \"&Nursing!F43&\"|\"&Nursing!$G$18&\": \"&Nursing!G43&\"|\"&Nursing!$H$18&\": \"&Nursing!H43","v":"Category: Reduced Physical Function | Conditions/Services: Restorative Nursing Services|Conditions/Services Present: 0-1|Section GG-Based Function Score: 15-16"}]
[]
[null,"NA",{"$f":"NTA!$A$5&\": \"&NTA!A6","v":"NTA Comorbidity Score: 12+"},{"$f":"NTA!$A$5&\": \"&INDEX(NTA!$A$13:$D$18,MATCH(#REF!,NTA!$D$13:$D$18,1),1)","v":{"$error":"#REF!"}}]
[null,"NB",{"$f":"NTA!$A$5&\": \"&NTA!A7","v":"NTA Comorbidity Score: 9-11"},{"$f":"INDEX(B58:C63,MATCH(D58,C58:C63,0),1)","v":{"$error":"#REF!"}}]
[null,"NC",{"$f":"NTA!$A$5&\": \"&NTA!A8","v":"NTA Comorbidity Score: 6-8"}]
[null,"ND",{"$f":"NTA!$A$5&\": \"&NTA!A9","v":"NTA Comorbidity Score: 3-5"}]
[null,"NE",{"$f":"NTA!$A$5&\": \"&NTA!A10","v":"NTA Comorbidity Score: 1-2"}]
[null,"NF",{"$f":"NTA!$A$5&\": \"&NTA!A11","v":"NTA Comorbidity Score: 0"}]

{"sheet":"VPD","index":10,"n_rows":26,"n_cols":6,"rows_kept":26,"cut":false,"hidden":true,"merged":[]}
["PT & OT"]
["Day in Stay"]
[null,null,"Adjustment Factor","Days Remaining","Weighted Days"]
[1,20,1,{"$f":"MAX(#REF!-B4,0)","v":{"$error":"#REF!"}},{"$f":"MIN(B4,#REF!)*C4","v":{"$error":"#REF!"}}]
[{"$f":"+A4+20","v":21},{"$f":"+B4+7","v":27},{"$f":"+C4-0.02","v":0.98},{"$f":"MAX(#REF!-B5,0)","v":{"$error":"#REF!"}},{"$f":"IF(D5>0,(B5-B4)*C5,D4*C5)","v":{"$error":"#REF!"}}]
[{"$f":"+A5+7","v":28},{"$f":"+B5+7","v":34},{"$f":"+C5-0.02","v":0.96},{"$f":"MAX(#REF!-B6,0)","v":{"$error":"#REF!"}},{"$f":"IF(D6>0,(B6-B5)*C6,D5*C6)","v":{"$error":"#REF!"}}]
[{"$f":"+A6+7","v":35},{"$f":"+B6+7","v":41},0.94,{"$f":"MAX(#REF!-B7,0)","v":{"$error":"#REF!"}},{"$f":"IF(D7>0,(B7-B6)*C7,D6*C7)","v":{"$error":"#REF!"}}]
[42,48,0.91999999999999993,{"$f":"MAX(#REF!-B8,0)","v":{"$error":"#REF!"}},{"$f":"IF(D8>0,(B8-B7)*C8,D7*C8)","v":{"$error":"#REF!"}}]
[49,55,0.89999999999999991,{"$f":"MAX(#REF!-B9,0)","v":{"$error":"#REF!"}},{"$error":"#REF!"}]
[56,62,0.87999999999999989,{"$f":"MAX(#REF!-B10,0)","v":{"$error":"#REF!"}},{"$error":"#REF!"}]
[63,69,0.85999999999999988,{"$f":"MAX(#REF!-B11,0)","v":{"$error":"#REF!"}},{"$error":"#REF!"}]
[70,76,0.83999999999999986,{"$f":"MAX(#REF!-B12,0)","v":{"$error":"#REF!"}},{"$error":"#REF!"}]
[77,83,0.81999999999999984,{"$f":"MAX(#REF!-B13,0)","v":{"$error":"#REF!"}},{"$error":"#REF!"}]
[84,90,0.79999999999999982,{"$f":"MAX(#REF!-B14,0)","v":{"$error":"#REF!"}},{"$error":"#REF!"}]
[{"$f":"+A14+7","v":91},{"$f":"+B14+7","v":97},0.7799999999999998,{"$f":"MAX(#REF!-B15,0)","v":{"$error":"#REF!"}},{"$error":"#REF!"}]
[98,100,0.75999999999999979,{"$f":"MAX(#REF!-B16,0)","v":{"$error":"#REF!"}},{"$error":"#REF!"}]
[null,null,null,null,{"$f":"SUM(E4:E16)","v":{"$error":"#REF!"}},"Total Weighted Days"]
[null,null,null,null,{"$f":"E17/#REF!","v":{"$error":"#REF!"}},"PT/OT VPD Adjustment"]
[]
["NTA"]
["Day in Stay"]
[null,null,"Adjustment Factor","Days Remaining","Weighted Days"]
[1,3,3,{"$f":"MAX(#REF!-B23,0)","v":{"$error":"#REF!"}},{"$f":"B23*C23","v":9}]
[4,100,1,{"$f":"MAX(#REF!-B24,0)","v":{"$error":"#REF!"}},{"$f":"IF(D24>0,(B24-B23)*C24,D23*C24)","v":{"$error":"#REF!"}}]
[null,null,null,null,{"$f":"SUM(E23:E24)","v":{"$error":"#REF!"}},"Total Weighted Days"]
[null,null,null,null,{"$f":"E25/#REF!","v":{"$error":"#REF!"}},"NTA VPD Adjustment"]

{"sheet":"PT","index":11,"n_rows":22,"n_cols":10,"rows_kept":22,"cut":false,"hidden":true,"merged":[]}
["PDPM PT CMI : Physical Therapy Case Mix Indices"]
["Overview"]
[]
["PT Component",null,null,null,null,"Points Assigned to Section GG Responses (Except Walking)",null,null,"Points Assigned to Section GG Responses ( Walking Items)"]
["Clinical Category","Function Score","PT Case Mix Group","CMI",null,"Section GG Responses","Function Score ",null,"Section GG Responses","Function Score "]
["Major Joint Replacement or Spinal Surgery","0-5","TA",1.53,{"$f":"IFERROR(LEFT(B6,FIND(\"-\",B6)-1),B6)*1","v":0},"Independent",4,null,"Independent",4]
["Major Joint Replacement or Spinal Surgery","6-9","TB",1.7,{"$f":"IFERROR(LEFT(B7,FIND(\"-\",B7)-1),B7)*1","v":6},"Set-up Assistance",4,null,"Set-up Assistance",4]
["Major Joint Replacement or Spinal Surgery","10-23","TC",1.88,10,"Supervision or touching assistance",3,null,"Supervision or touching assistance",3]
["Major Joint Replacement or Spinal Surgery","24","TD",1.92,24,"Partial/moderate assistance",2,null,"Partial/moderate assistance",2]
["Other Orthopedic","0-5","TE",1.42,null,"Substantial/maximal assistance",1,null,"Substantial/maximal assistance",1]
["Other Orthopedic","6-9","TF",1.61,null,"Dependent",0,null,"Dependent",0]
["Other Orthopedic","10-23","TG",1.67,null,"Refused",0,null,"Refused",0]
["Other Orthopedic","24","TH",1.1599999999999999,null,"N/A",0,null,"N/A",0]
["Medical Management","0-5","TI",1.1299999999999999,null,"Not Attempted",0,null,"Not Attempted, Resident Cannot Walk",0]
["Medical Management","6-9","TJ",1.42]
["Medical Management","10-23","TK",1.52]
["Medical Management","24","TL",1.0900000000000001]
["Non-Orthopedic Surgery and Acute Neurologic","0-5","TM",1.27]
["Non-Orthopedic Surgery and Acute Neurologic","6-9","TN",1.48]
["Non-Orthopedic Surgery and Acute Neurologic","10-23","TO",1.55]
["Non-Orthopedic Surgery and Acute Neurologic","24","TP",1.08]
[null,null,null,null,null,null,null,null,null,"End of Worksheet"]

{"sheet":"OT","index":12,"n_rows":22,"n_cols":10,"rows_kept":22,"cut":false,"hidden":true,"merged":[]}
["PDPM OT CMI : Occupational Therapy Case Mix Indices"]
["Overview"]
[]
["OT Component",null,null,null,null,"Points Assigned to Section GG Responses (Except Walking)",null,null,"Points Assigned to Section GG Responses ( Walking Items)"]
["Clinical Category","Function Score","OT Case Mix Group","CMI",null,"Section GG Responses","Function Score ",null,"Section GG Responses","Function Score "]
["Major Joint Replacement or Spinal Surgery","0-5","TA",1.49,null,"Independent",4,null,"Independent",4]
["Major Joint Replacement or Spinal Surgery","6-9","TB",1.63,null,"Set-up Assistance",4,null,"Set-up Assistance",4]
["Major Joint Replacement or Spinal Surgery","10-23","TC",1.69,null,"Supervision or touching assistance",3,null,"Supervision or touching assistance",3]
["Major Joint Replacement or Spinal Surgery","24","TD",1.53,null,"Partial/moderate assistance",2,null,"Partial/moderate assistance",2]
["Other Orthopedic","0-5","TE",1.41,null,"Substantial/maximal assistance",1,null,"Substantial/maximal assistance",1]
["Other Orthopedic","6-9","TF",1.6,null,"Dependent",0,null,"Dependent",0]
["Other Orthopedic","10-23","TG",1.64,null,"Refused",0,null,"Refused",0]
["Other Orthopedic","24","TH",1.1499999999999999,null,"N/A",0,null,"N/A",0]
["Medical Management","0-5","TI",1.18,null,"Not Attempted",0,null,"Not Attempted, Resident Cannot Walk",0]
["Medical Management","6-9","TJ",1.45]
["Medical Management","10-23","TK",1.54]
["Medical Management","24","TL",1.1100000000000001]
["Non-Orthopedic Surgery and Acute Neurologic","0-5","TM",1.3]
["Non-Orthopedic Surgery and Acute Neurologic","6-9","TN",1.5]
["Non-Orthopedic Surgery and Acute Neurologic","10-23","TO",1.55]
["Non-Orthopedic Surgery and Acute Neurologic","24","TP",1.0900000000000001]
[null,null,null,null,null,null,null,null,null,"End of Worksheet"]

{"sheet":"SLP","index":13,"n_rows":83,"n_cols":8,"rows_kept":83,"cut":false,"hidden":true,"merged":[]}
["PDPM SLP CMI : Speech-Language Pathology Case Mix Indices"]
["Overview"]
[]
["SLP Component",null,null,null,null,"Cognitive Impairment*"]
["Presence of Acute Neurologic Condition, SLP-Related Comorbidity, or Cognitive Impairment","Mechanically Altered Diet or Swallowing Disorder","SLP Case Mix Group","CMI",null,"PDPM Cognitive Level","BIMS Score","Staff Assessment Score"]
["None","Neither","SA",0.68,null,"1 - Cognitively Intact","13-15",0]
["None","Either","SB",1.82,null,"2 - Mildly Impaired","8-12","1-2"]
["None","Both","SC",2.67,null,"3 - Moderately Impaired","0-7","3-4"]
["Any one","Neither","SD",1.46,null,"4 - Severely Impaired","-","5-6"]
["Any one","Either","SE",2.34,null,"*Note: Residents are classified as cognitively impaired when they are assessed to be mildly, moderately, or severely impaired"]
["Any one","Both","SF",2.98]
["Any two","Neither","SG",2.04]
["Any two","Either","SH",2.86,null,"Comorbidities Included in SLP Component"]
["Any two","Both","SI",3.53,null,"Condition","ICD-10-CM Code","Description"]
["All three","Neither","SJ",2.99,null,"ALS","G12.21","Amyotrophic lateral sclerosis"]
["All three","Either","SK",3.7,null,"Apraxia","I69.990","Apraxia following unspecified cerebrovascular disease"]
["All three","Both","SL",4.21,null,"Dysphagia","I69.991","Dysphagia following unspecified cerebrovascular disease"]
[null,null,null,null,null,"Laryngeal Cancer","C32.0","Malignant neoplasm of glottis"]
[null,null,null,null,null,"Laryngeal Cancer","C32.1","Malignant neoplasm of supraglottis"]
[null,null,null,null,null,"Laryngeal Cancer","C32.2","Malignant neoplasm of subglottis"]
[null,null,null,null,null,"Laryngeal Cancer","C32.3","Malignant neoplasm of laryngeal cartilage"]
[null,null,null,null,null,"Laryngeal Cancer","C32.8","Malignant neoplasm of other specified sites of larynx"]
[null,null,null,null,null,"Laryngeal Cancer","C32.9","Malignant neoplasm of larynx, unspecified"]
[null,null,null,null,null,"Oral Cancers","C00.0","Malignant neoplasm of external upper lip"]
[null,null,null,null,null,"Oral Cancers","C00.1","Malignant neoplasm of external lower lip"]
[null,null,null,null,null,"Oral Cancers","C00.3","Malignant neoplasm of upper lip, inner aspect"]
[null,null,null,null,null,"Oral Cancers","C00.4","Malignant neoplasm of lower lip, inner aspect"]
[null,null,null,null,null,"Oral Cancers","C00.5","Malignant neoplasm of lip, unspecified, inner aspect"]
[null,null,null,null,null,"Oral Cancers","C00.6","Malignant neoplasm of commissure of lip, unspecified"]
[null,null,null,null,null,"Oral Cancers","C00.8","Malignant neoplasm of overlapping sites of lip"]
[null,null,null,null,null,"Oral Cancers","C00.2","Malignant neoplasm of external lip, unspecified"]
[null,null,null,null,null,"Oral Cancers","C00.9","Malignant neoplasm of lip, unspecified"]
[null,null,null,null,null,"Oral Cancers","C01","Malignant neoplasm of base of tongue"]
[null,null,null,null,null,"Oral Cancers","C02.0","Malignant neoplasm of dorsal surface of tongue"]
[null,null,null,null,null,"Oral Cancers","C02.1","Malignant neoplasm of border of tongue"]
[null,null,null,null,null,"Oral Cancers","C02.2","Malignant neoplasm of ventral surface of tongue"]
[null,null,null,null,null,"Oral Cancers","C02.3","Malignant neoplasm of anterior two-thirds of tongue, part unspecified"]
[null,null,null,null,null,"Oral Cancers","C02.8","Malignant neoplasm of overlapping sites of tongue"]
[null,null,null,null,null,"Oral Cancers","C02.4","Malignant neoplasm of lingual tonsil"]
[null,null,null,null,null,"Oral Cancers","C02.8","Malignant neoplasm of overlapping sites of tongue"]
[null,null,null,null,null,"Oral Cancers","C02.9","Malignant neoplasm of tongue, unspecified"]
[null,null,null,null,null,"Oral Cancers","C03.0","Malignant neoplasm of upper gum"]
[null,null,null,null,null,"Oral Cancers","C03.1","Malignant neoplasm of lower gum"]
[null,null,null,null,null,"Oral Cancers","C03.9","Malignant neoplasm of gum, unspecified"]
[null,null,null,null,null,"Oral Cancers","C03.9","Malignant neoplasm of gum, unspecified"]
[null,null,null,null,null,"Oral Cancers","C04.0","Malignant neoplasm of anterior floor of mouth"]
[null,null,null,null,null,"Oral Cancers","C04.1","Malignant neoplasm of lateral floor of mouth"]
[null,null,null,null,null,"Oral Cancers","C04.8","Malignant neoplasm of overlapping sites of floor of mouth"]
[null,null,null,null,null,"Oral Cancers","C04.9","Malignant neoplasm of floor of mouth, unspecified"]
[null,null,null,null,null,"Oral Cancers","C09.9","Malignant neoplasm of tonsil, unspecified"]
[null,null,null,null,null,"Oral Cancers","C09.8","Malignant neoplasm of overlapping sites of tonsil"]
[null,null,null,null,null,"Oral Cancers","C09.0","Malignant neoplasm of tonsillar fossa"]
[null,null,null,null,null,"Oral Cancers","C09.1","Malignant neoplasm of tonsillar pillar (anterior) (posterior)"]
[null,null,null,null,null,"Oral Cancers","C10.0","Malignant neoplasm of vallecula"]
[null,null,null,null,null,"Oral Cancers","C10.1","Malignant neoplasm of anterior surface of epiglottis"]
[null,null,null,null,null,"Oral Cancers","C10.8","Malignant neoplasm of overlapping sites of oropharynx"]
[null,null,null,null,null,"Oral Cancers","C10.2","Malignant neoplasm of lateral wall of oropharynx"]
[null,null,null,null,null,"Oral Cancers","C10.3","Malignant neoplasm of posterior wall of oropharynx"]
[null,null,null,null,null,"Oral Cancers","C10.4","Malignant neoplasm of branchial cleft"]
[null,null,null,null,null,"Oral Cancers","C10.8","Malignant neoplasm of overlapping sites of oropharynx"]
[null,null,null,null,null,"Oral Cancers","C10.9","Malignant neoplasm of oropharynx, unspecified"]
[null,null,null,null,null,"Oral Cancers","C14.0","Malignant neoplasm of pharynx, unspecified"]
[null,null,null,null,null,"Oral Cancers","C14.2","Malignant neoplasm of waldeyer's ring"]
[null,null,null,null,null,"Oral Cancers","C14.8","Malignant neoplasm of overlapping sites of lip, oral cavity and pharynx"]
[null,null,null,null,null,"Oral Cancers","C14.8","Malignant neoplasm of overlapping sites of lip, oral cavity and pharynx"]
[null,null,null,null,null,"Oral Cancers","C06.0","Malignant neoplasm of cheek mucosa"]
[null,null,null,null,null,"Oral Cancers","C06.1","Malignant neoplasm of vestibule of mouth"]
[null,null,null,null,null,"Oral Cancers","C05.0","Malignant neoplasm of hard palate"]
[null,null,null,null,null,"Oral Cancers","C05.1","Malignant neoplasm of soft palate"]
[null,null,null,null,null,"Oral Cancers","C05.2","Malignant neoplasm of uvula"]
[null,null,null,null,null,"Oral Cancers","C05.9","Malignant neoplasm of palate, unspecified"]
[null,null,null,null,null,"Oral Cancers","C05.8","Malignant neoplasm of overlapping sites of palate"]
[null,null,null,null,null,"Oral Cancers","C06.2","Malignant neoplasm of retromolar area"]
[null,null,null,null,null,"Oral Cancers","C06.89","Malignant neoplasm of overlapping sites of other parts of mouth"]
[null,null,null,null,null,"Oral Cancers","C06.80","Malignant neoplasm of overlapping sites of unspecified parts of mouth"]
[null,null,null,null,null,"Oral Cancers","C06.9","Malignant neoplasm of mouth, unspecified"]
[null,null,null,null,null,"Speech and Language Deficits","I69.928","Other speech and language deficits following unspecified cerebrovascular disease"]
[null,null,null,null,null,"Speech and Language Deficits","I69.920","Aphasia following unspecified cerebrovascular disease"]
[null,null,null,null,null,"Speech and Language Deficits","I69.921","Dysphasia following unspecified cerebrovascular disease"]
[null,null,null,null,null,"Speech and Language Deficits","I69.922","Dysarthria following unspecified cerebrovascular disease"]
[null,null,null,null,null,"Speech and Language Deficits","I69.923","Fluency disorder following unspecified cerebrovascular disease"]
[null,null,null,null,null,"Speech and Language Deficits","I69.928","Other speech and language deficits following unspecified cerebrovascular disease"]
[null,null,null,null,null,null,null,"End of Worksheet"]

{"sheet":"NTA","index":14,"n_rows":56,"n_cols":7,"rows_kept":56,"cut":false,"hidden":true,"merged":[]}
["PDPM NTA CMI : Non-Therapy Ancillary Case Mix Indices"]
["Overview"]
[]
["NTA Component",null,null,null,"Comorbidities Included in NTA Comorbidity Score and Assigned Points"]
["NTA Comorbidity Score","NTA Case Mix Group","CMI",null,"Condition/Extensive Service","MDS Item","Points"]
["12+","NA",3.24,{"$f":"IFERROR(LEFT(A6,FIND(\"-\",A6)-1)*1,12)","v":12},"HIV/AIDS ","SNF Claim ICD-10 B20",8]
["9-11","NB",2.5299999999999998,{"$f":"IFERROR(LEFT(A7,FIND(\"-\",A7)-1)*1,A7)","v":9},"Parenteral IV Feeding: Level High ","K0510A2  K0710A2",7]
["6-8","NC",1.84,6,"Special Treatments/Programs: Intravenous Medication Post-admit Code ","O0100H2 ",5]
["3-5","ND",1.33,3,"Special Treatments/Programs: Ventilator Post-admit Code ","O0100F2 ",4]
["1-2","NE",0.96,1,"Parenteral IV feeding: Level Low","K0510A2  K0710A2  K0710B2",3]
[0,"NF",0.72,{"$f":"IFERROR(LEFT(A11,FIND(\"-\",A11)-1)*1,A11)","v":0},"Lung Transplant Status ","I8000",3]
[null,null,null,null,"Special Treatments/Programs: Transfusion Post-admit Code ","O0100I2 ",2]
[0,"NF",null,0,"Major Organ Transplant Status, Except Lung ","I8000",2]
["1-2","NE",null,1,"Active Diagnoses: Multiple Sclerosis Code ","I5200 ",2]
["3-5","ND",null,3,"Opportunistic Infections ","I8000",2]
["6-8","NC",null,6,"Active Diagnoses: Asthma  COPD  Chronic Lung Disease Code ","I6200 ",2]
["9-11","NB",null,9,"Bone/Joint/Muscle Infections/Necrosis - Except: Aseptic Necrosis of Bone ","I8000",2]
["12+","NA",null,12,"Chronic Myeloid Leukemia ","I8000",2]
[null,null,null,null,"Wound Infection Code ","I2500 ",2]
[null,null,null,null,"Active Diagnoses: Diabetes Mellitus (DM) Code ","I2900 ",2]
[null,null,null,null,"Endocarditis ","I8000",1]
[null,null,null,null,"Immune Disorders ","I8000",1]
[null,null,null,null,"End-Stage Liver Disease ","I8000",1]
[null,null,null,null,"Other Foot Skin Problems: Diabetic Foot Ulcer Code ","M1040B ",1]
[null,null,null,null,"Narcolepsy and Cataplexy ","I8000",1]
[null,null,null,null,"Cystic Fibrosis ","I8000",1]
[null,null,null,null,"Special Treatments/Programs: Tracheostomy Post-admit Code ","O0100E2 ",1]
[null,null,null,null,"Active Diagnoses: Multi-Drug Resistant Organism (MDRO) Code ","I1700 ",1]
[null,null,null,null,"Special Treatments/Programs: Isolation Post-admit Code ","O0100M2 ",1]
[null,null,null,null,"Specified Hereditary Metabolic/Immune Disorders ","I8000",1]
[null,null,null,null,"Morbid Obesity ","I8000",1]
[null,null,null,null,"Special Treatments/Programs: Radiation Post-admit Code ","O0100B2 ",1]
[null,null,null,null,"Highest Stage of Unhealed Pressure Ulcer - Stage 4 ","M0300X1 ",1]
[null,null,null,null,"Psoriatic Arthropathy and Systemic Sclerosis ","I8000",1]
[null,null,null,null,"Chronic Pancreatitis ","I8000",1]
[null,null,null,null,"Proliferative Diabetic Retinopathy and Vitreous Hemorrhage ","I8000",1]
[null,null,null,null,"Other Foot Skin Problems: Foot Infection Code, Other Open Lesion on Foot Code, Except Diabetic Foot Ulcer Code ","M1040A  M1040B  M1040C  ",1]
[null,null,null,null,"Complications of Specified Implanted Device or Graft ","I8000",1]
[null,null,null,null,"Bladder and Bowel Appliances: Intermittent catheterization ","H0100D ",1]
[null,null,null,null,"Inflammatory Bowel Disease ","I8000",1]
[null,null,null,null,"Aseptic Necrosis of Bone ","I8000",1]
[null,null,null,null,"Special Treatments/Programs: Suctioning Post-admit Code ","O0100D2 ",1]
[null,null,null,null,"Cardio-Respiratory Failure and Shock ","I8000",1]
[null,null,null,null,"Myelodysplastic Syndromes and Myelofibrosis ","I8000",1]
[null,null,null,null,"Systemic Lupus Erythematosus, Other Connective Tissue Disorders, and Inflammatory Spondylopathies ","I8000",1]
[null,null,null,null,"Diabetic Retinopathy - Except : Proliferative Diabetic Retinopathy and Vitreous Hemorrhage ","I8000",1]
[null,null,null,null,"Nutritional Approaches While a Resident: Feeding Tube ","K0510B2 ",1]
[null,null,null,null,"Severe Skin Burn or Condition ","I8000",1]
[null,null,null,null,"Intractable Epilepsy ","I8000",1]
[null,null,null,null,"Active Diagnoses: Malnutrition Code ","I5600 ",1]
[null,null,null,null,"Disorders of Immunity - Except : RxCC97: Immune Disorders ","I8000",1]
[null,null,null,null,"Cirrhosis of Liver ","I8000",1]
[null,null,null,null,"Bladder and Bowel Appliances: Ostomy ","H0100C ",1]
[null,null,null,null,"Respiratory Arrest ","I8000",1]
[null,null,null,null,"Pulmonary Fibrosis and Other Chronic Lung Disorders ","I8000",1]
[null,null,null,null,null,null,"End of Worksheet"]

{"sheet":"Nursing","index":15,"n_rows":51,"n_cols":10,"rows_kept":51,"cut":false,"hidden":true,"merged":[]}
["PDPM Nursing CMI : Nursing Case Mix Indices"]
["Overview"]
[]
["Nursing Component",null,null,null,"Points Assigned to Section GG Responses (All Items Except Walking and Oral Hygiene Items)"]
["PDPM Nursing RUG","Function Score ","CMI",null,"Section GG Responses","Function Score "]
["ES3","0-14",4.0599999999999996,null,"Independent",4]
["ES2","0-14",3.07,null,"Set-up Assistance",4]
["ES1","0-14",2.93,null,"Supervision or touching assistance",3]
["HDE2","0-5",2.4,null,"Partial/moderate assistance",2]
["HDE1","0-5",1.99,null,"Substantial/maximal assistance",1]
["HBC2","6-14",2.2400000000000002,null,"Dependent",0]
["HBC1","6-14",1.86,null,"Refused",0]
["LDE2","0-5",2.08,null,"N/A",0]
["LDE1","0-5",1.73,null,"Not Attempted",0]
["LBC2","6-14",1.72]
["LBC1","6-14",1.43]
["CDE2","0-5",1.87,null,"Nursing Classification"]
["CDE1","0-5",1.62,null,"Nursing Category","Conditions/Services","Conditions/Services Present","Section GG-Based Function Score","PDPM RUG"]
["CBC2","6-14",1.55,null,"Extensive Services","Tracheostomy Care and Ventilator/Respirator","Yes","0-14","ES1"]
["CA2","15-16",1.0900000000000001,null,"Extensive Services","Tracheostomy Care or Ventilator/Respirator","Yes","0-14","ES2"]
["CBC1","6-14",1.34,null,"Extensive Services","Infection Isolation","Yes","0-14","ES3"]
["CA1","15-16",0.94,null,"Special Care High","Depressed","Yes","0-5","HDE2"]
["BAB2","11-16",1.04,null,"Special Care High","Depressed","No","0-5","HDE1"]
["BAB1","11-16",0.99,null,"Special Care High","Depressed","Yes","6-14","HBC2"]
["PDE2","0-5",1.57,null,"Special Care High","Depressed","No","6-14","HBC1"]
["PDE1","0-5",1.47,null,"Special Care Low","Depressed","Yes","0-5","LDE2 "]
["PBC2","6-14",1.22,null,"Special Care Low","Depressed","No","0-5","LDE1 "]
["PA2","15-16",0.71,null,"Special Care Low","Depressed","Yes","6-14","LBC2"]
["PBC1","6-14",1.1299999999999999,null,"Special Care Low","Depressed","No","6-14","LBC1"]
["PA1","15-16",0.66,null,"Clinically Complex","Depressed","Yes","0-5","CDE2"]
[null,null,null,null,"Clinically Complex","Depressed","No","0-5","CDE1"]
[null,null,null,null,"Clinically Complex","Depressed","Yes","6-14","CBC2"]
[null,null,null,null,"Clinically Complex","Depressed","Yes","15-16","CA2"]
[null,null,null,null,"Clinically Complex","Depressed","No","6-14","CBC1"]
[null,null,null,null,"Clinically Complex","Depressed","No","15-16","CA1"]
[null,null,null,null,"Behavioral Cognitive Symptoms","Restorative Nursing Services","2 or More","11-16","BAB2"]
[null,null,null,null,"Behavioral Cognitive Symptoms","Restorative Nursing Services","0-1","11-16","BAB1"]
[null,null,null,null,"Reduced Physical Function","Restorative Nursing Services","2 or More","0-5","PDE2"]
[null,null,null,null,"Reduced Physical Function","Restorative Nursing Services","0-1","0-5","PDE1",{"$f":"IFERROR(LEFT(B26,FIND(\"-\",B26)-1),B26)*1","v":0}]
[null,null,null,null,"Reduced Physical Function","Restorative Nursing Services","2 or More","6-14","PBC2",{"$f":"IFERROR(LEFT(B27,FIND(\"-\",B27)-1),B27)*1","v":6}]
[null,null,null,null,"Reduced Physical Function","Restorative Nursing Services","2 or More","15-16","PA2",{"$f":"IFERROR(LEFT(B28,FIND(\"-\",B28)-1),B28)*1","v":15}]
[null,null,null,null,"Reduced Physical Function","Restorative Nursing Services","0-1","6-14","PBC1"]
[null,null,null,null,"Reduced Physical Function","Restorative Nursing Services","0-1","15-16","PA1"]
[null,null,null,null,null,null,null,null,"End of Worksheet"]
[]
[null,null,null,null,null,"Tracheostomy Care and Ventilator/Respirator"]
[null,null,null,null,null,"Tracheostomy Care or Ventilator/Respirator"]
[null,null,null,null,null,"Infection Isolation"]
[null,null,null,null,null,"Depressed"]
[null,null,null,null,null,"Restorative Nursing Services"]
[null,null,null,null,null,"Other"]

{"sheet":"FY 2019 SNF PPS Rates","index":16,"n_rows":99,"n_cols":14,"rows_kept":99,"cut":false,"hidden":true,"merged":[[80,1,83,1],[84,1,92,1],[95,1,97,10],[28,1,36,1],[37,1,50,1],[51,1,53,1],[54,1,61,1],[62,1,69,1],[70,1,79,1],[15,2,15,3],[7,1,7,10],[11,2,11,3],[12,2,12,5],[13,2,13,5],[14,5,14,6]]}
[]
[]
[]
[]
[]
[]
[]
[null,"SNF and/or Swing Bed Medicare Part A FINAL SNF PPS RUG IV RATES"]
[]
[null,null,"Select your county  from the drop down box below"]
[]
[null,"CBSA Code:",{"$f":"IF($C$13=\"Select County\",\"Select County\",VLOOKUP($C$13,CBSACodes,2,FALSE))","v":{"$error":"#REF!"}},null,null,null,null,"<-- This is your CBSA Code"]
[null,"Selected County:",{"$f":"#REF!","v":{"$error":"#REF!"}},null,null,null,null,"<-- Select your county from the dropbox"]
[null,"CBSA Designation",{"$f":"IF($C$13=\"Select County\",\"Select County\",VLOOKUP($C$12,CBSADesignations,2,FALSE))","v":{"$error":"#REF!"}},null,null,null,null,"<-- This is your CBSA Designation Description"]
[null,"Wage Index:",{"$f":"IF($C$13=\"Select County\",\"Select County\",VLOOKUP($C$13,'Data - Wage Indexes'!A1:B3222,2,FALSE))","v":{"$error":"#REF!"}},"- FINAL FY2019",null,{"$f":"IF($C$13=\"Select County\",\"Select County\",VLOOKUP($C$13,'Data - Wage Indexes'!A1:D3222,8,FALSE))&\" \"&\" Final FY2018\"","v":{"$error":"#REF!"}},null,"<-- This is the Wage Index used on the calculations below"]
[null,"Urban/Rural Status:",{"$f":"IF($C$13=\"Select County\",\"Select County\",IF(LEFT($C$12,3)=\"999\",\"Rural\",\"Urban\"))","v":{"$error":"#REF!"}},null,null,null,null,"< -- This is your Urban/Rural Status"]
[]
[null,null,"Resident with AIDS? Y/N",null,null,"N",null,"<-- Yes(Y) / No(N)"]
[]
[]
[]
[null,null,null,null,null," EFFECTIVE FOR SERVICES BEGINNING",null,null,null,null,"10/1/2018*"]
[]
[null,null,"RUG-IV","Revenue","Labor","X Wage","Indexed","+ Non","= Total","Increase",{"$f":"IF($F$18=\"Y\",\"MMA\",\"BIPA\")","v":"BIPA"}]
[null,null,"Group","Code","Component","Index","Labor","Labor","Federal",{"$f":"IF(F18=\"Y\", \"Per MMA\", \"Per BIPA\")","v":"Per BIPA"},"Adjusted"]
[null,null,null,null,null,null,"Portion","Portion","Payment",{"$f":"IF(F18=\"Y\",\"of 2003\",\"of 2000\")","v":"of 2000"},"Federal"]
[null,null,null,null,null,null,null,null,"at 100 %","for FY2017*","Payment"]
[null,null,null,null,null,null,null,null,null,null,null,null,"Minutes","ADLs"]
[null,"Rehab Plus Extensive Services","RUX",9066,{"$f":"IF($C$12=\"Select County\",0,VLOOKUP(CONCATENATE($C29,\"-\",LEFT($C$16,1)),Rates,3,FALSE))","v":{"$error":"#REF!"}},{"$f":"IF($C$15=\"Select County\",0,$C$15)","v":{"$error":"#REF!"}},{"$f":"ROUND(E29*F29, 2)","v":{"$error":"#REF!"}},{"$f":"IF($C$12=\"Select County\",0,VLOOKUP(CONCATENATE($C29,\"-\",LEFT($C$16,1)),Rates,4,FALSE))","v":{"$error":"#REF!"}},{"$f":"ROUND(G29+H29,2)","v":{"$error":"#REF!"}},{"$f":"IF(F$18=\"Y\",ROUND(I29*1.28,2),0)","v":0},{"$f":"ROUND(I29+J29,2)","v":{"$error":"#REF!"}},null,"720+","11-16"]
[null,null,"RUL",9065,{"$error":"#REF!"},{"$f":"IF($C$15=\"Select County\",0,$C$15)","v":{"$error":"#REF!"}},{"$f":"ROUND(E30*F30, 2)","v":{"$error":"#REF!"}},{"$error":"#REF!"},{"$f":"ROUND(G30+H30,2)","v":{"$error":"#REF!"}},{"$f":"IF(F$18=\"Y\",ROUND(I30*1.28,2),0)","v":0},{"$f":"ROUND(I30+J30,2)","v":{"$error":"#REF!"}},null,"720+","2-10"]
[null,null,"RVX",9064,{"$error":"#REF!"},{"$error":"#REF!"},{"$f":"ROUND(E31*F31, 2)","v":{"$error":"#REF!"}},{"$error":"#REF!"},{"$error":"#REF!"},0,{"$error":"#REF!"},null,"500-719","11-16"]
[null,null,"RVL",9063,{"$error":"#REF!"},{"$error":"#REF!"},{"$error":"#REF!"},{"$error":"#REF!"},{"$error":"#REF!"},0,{"$error":"#REF!"},null,"500-719","2-10"]
[null,null,"RHX",9062,{"$error":"#REF!"},{"$error":"#REF!"},{"$error":"#REF!"},{"$error":"#REF!"},{"$error":"#REF!"},0,{"$error":"#REF!"},null,"325-499","11-16"]
[null,null,"RHL",9061,{"$error":"#REF!"},{"$error":"#REF!"},{"$error":"#REF!"},{"$error":"#REF!"},{"$error":"#REF!"},0,{"$error":"#REF!"},null,"325-499","2-10"]
[null,null,"RMX",9060,{"$error":"#REF!"},{"$error":"#REF!"},{"$error":"#REF!"},{"$error":"#REF!"},{"$error":"#REF!"},0,{"$error":"#REF!"},null,"150-324","11-16"]
[null,null,"RML",9059,{"$error":"#REF!"},{"$error":"#REF!"},{"$error":"#REF!"},{"$error":"#REF!"},{"$error":"#REF!"},0,{"$error":"#REF!"},null,"150-324","2-10"]
[null,null,"RLX",9058,{"$error":"#REF!"},{"$error":"#REF!"},{"$error":"#REF!"},{"$error":"#REF!"},{"$error":"#REF!"},0,{"$error":"#REF!"},null,"45-149","2-16"]
[null,"Rehab","RUC",9057,{"$error":"#REF!"},{"$error":"#REF!"},{"$error":"#REF!"},{"$error":"#REF!"},{"$error":"#REF!"},0,{"$error":"#REF!"},null,"720+","11-16"]
[null,null,"RUB",9056,{"$error":"#REF!"},{"$error":"#REF!"},{"$error":"#REF!"},{"$error":"#REF!"},{"$error":"#REF!"},0,{"$error":"#REF!"},null,"720+","6-10"]
[null,null,"RUA",9055,{"$error":"#REF!"},{"$error":"#REF!"},{"$error":"#REF!"},{"$error":"#REF!"},{"$error":"#REF!"},0,{"$error":"#REF!"},null,"720+","0-5"]
[null,null,"RVC",9054,{"$error":"#REF!"},{"$error":"#REF!"},{"$error":"#REF!"},{"$error":"#REF!"},{"$error":"#REF!"},0,{"$error":"#REF!"},null,"500-719","11-16"]
[null,null,"RVB",9053,{"$error":"#REF!"},{"$error":"#REF!"},{"$error":"#REF!"},{"$error":"#REF!"},{"$error":"#REF!"},0,{"$error":"#REF!"},null,"500-719","6-10"]
[null,null,"RVA",9052,{"$error":"#REF!"},{"$error":"#REF!"},{"$error":"#REF!"},{"$error":"#REF!"},{"$error":"#REF!"},0,{"$error":"#REF!"},null,"500-719","0-5"]
[null,null,"RHC",9051,{"$error":"#REF!"},{"$error":"#REF!"},{"$error":"#REF!"},{"$error":"#REF!"},{"$error":"#REF!"},0,{"$error":"#REF!"},null,"325-499","11-16"]
[null,null,"RHB",9050,{"$error":"#REF!"},{"$error":"#REF!"},{"$error":"#REF!"},{"$error":"#REF!"},{"$error":"#REF!"},0,{"$error":"#REF!"},null,"325-499","6-10"]
[null,null,"RHA",9049,{"$error":"#REF!"},{"$error":"#REF!"},{"$error":"#REF!"},{"$error":"#REF!"},{"$error":"#REF!"},0,{"$error":"#REF!"},null,"325-499","0-5"]
[null,null,"RMC",9048,{"$error":"#REF!"},{"$error":"#REF!"},{"$error":"#REF!"},{"$error":"#REF!"},{"$error":"#REF!"},0,{"$error":"#REF!"},null,"150-324","11-16"]
[null,null,"RMB",9047,{"$error":"#REF!"},{"$error":"#REF!"},{"$error":"#REF!"},{"$error":"#REF!"},{"$error":"#REF!"},0,{"$error":"#REF!"},null,"150-324","6-10"]
[null,null,"RMA",9046,{"$error":"#REF!"},{"$error":"#REF!"},{"$error":"#REF!"},{"$error":"#REF!"},{"$error":"#REF!"},0,{"$error":"#REF!"},null,"150-324","0-5"]
[null,null,"RLB",9045,{"$error":"#REF!"},{"$error":"#REF!"},{"$error":"#REF!"},{"$error":"#REF!"},{"$error":"#REF!"},0,{"$error":"#REF!"},null,"45-149","11-16"]
[null,null,"RLA",9044,{"$error":"#REF!"},{"$error":"#REF!"},{"$error":"#REF!"},{"$error":"#REF!"},{"$error":"#REF!"},0,{"$error":"#REF!"},null,"45-149","0-10"]
[null,"Extensive Services","ES3",9043,{"$error":"#REF!"},{"$error":"#REF!"},{"$error":"#REF!"},{"$error":"#REF!"},{"$error":"#REF!"},0,{"$error":"#REF!"},null,"N/A","2-16"]
[null,null,"ES2",9042,{"$error":"#REF!"},{"$error":"#REF!"},{"$error":"#REF!"},{"$error":"#REF!"},{"$error":"#REF!"},0,{"$error":"#REF!"},null,"N/A","2-16"]
[null,null,"ES1",9041,{"$error":"#REF!"},{"$error":"#REF!"},{"$error":"#REF!"},{"$error":"#REF!"},{"$error":"#REF!"},0,{"$error":"#REF!"},null,"N/A","2-16"]
[null,"Special Care High","HE2",9040,{"$error":"#REF!"},{"$error":"#REF!"},{"$error":"#REF!"},{"$error":"#REF!"},{"$error":"#REF!"},0,{"$error":"#REF!"},null,"N/A","15-16"]
[null,null,"HE1",9039,{"$error":"#REF!"},{"$error":"#REF!"},{"$error":"#REF!"},{"$error":"#REF!"},{"$error":"#REF!"},0,{"$error":"#REF!"},null,"N/A","15-16"]
[null,null,"HD2",9038,{"$error":"#REF!"},{"$error":"#REF!"},{"$error":"#REF!"},{"$error":"#REF!"},{"$error":"#REF!"},0,{"$error":"#REF!"},null,"N/A","11-14"]
[null,null,"HD1",9037,{"$error":"#REF!"},{"$error":"#REF!"},{"$error":"#REF!"},{"$error":"#REF!"},{"$error":"#REF!"},0,{"$error":"#REF!"},null,"N/A","11-14"]
[null,null,"HC2",9036,{"$error":"#REF!"},{"$error":"#REF!"},{"$error":"#REF!"},{"$error":"#REF!"},{"$error":"#REF!"},0,{"$error":"#REF!"},null,"N/A","6-10"]
[null,null,"HC1",9035,{"$error":"#REF!"},{"$error":"#REF!"},{"$error":"#REF!"},{"$error":"#REF!"},{"$error":"#REF!"},0,{"$error":"#REF!"},null,"N/A","6-10"]
[null,null,"HB2",9034,{"$f":"IF($C$12=\"Select County\",0,VLOOKUP(CONCATENATE($C61,\"-\",LEFT($C$16,1)),Rates,3,FALSE))","v":{"$error":"#REF!"}},{"$error":"#REF!"},{"$error":"#REF!"},{"$f":"IF($C$12=\"Select County\",0,VLOOKUP(CONCATENATE($C61,\"-\",LEFT($C$16,1)),Rates,4,FALSE))","v":{"$error":"#REF!"}},{"$error":"#REF!"},0,{"$error":"#REF!"},null,"N/A","2-5"]
[null,null,"HB1",9033,{"$error":"#REF!"},{"$error":"#REF!"},{"$error":"#REF!"},{"$error":"#REF!"},{"$error":"#REF!"},0,{"$error":"#REF!"},null,"N/A","2-5"]
[null,"Special Care Low","LE2",9032,{"$error":"#REF!"},{"$error":"#REF!"},{"$error":"#REF!"},{"$error":"#REF!"},{"$error":"#REF!"},0,{"$error":"#REF!"},null,"N/A","15-16"]
[null,null,"LE1",9031,{"$error":"#REF!"},{"$error":"#REF!"},{"$error":"#REF!"},{"$error":"#REF!"},{"$error":"#REF!"},0,{"$error":"#REF!"},null,"N/A","15-16"]
[null,null,"LD2",9030,{"$error":"#REF!"},{"$error":"#REF!"},{"$error":"#REF!"},{"$error":"#REF!"},{"$error":"#REF!"},0,{"$error":"#REF!"},null,"N/A","11-14"]
[null,null,"LD1",9029,{"$error":"#REF!"},{"$error":"#REF!"},{"$error":"#REF!"},{"$error":"#REF!"},{"$error":"#REF!"},0,{"$error":"#REF!"},null,"N/A","11-14"]
[null,null,"LC2",9028,{"$error":"#REF!"},{"$error":"#REF!"},{"$error":"#REF!"},{"$error":"#REF!"},{"$error":"#REF!"},0,{"$error":"#REF!"},null,"N/A","6-10"]
[null,null,"LC1",9027,{"$error":"#REF!"},{"$error":"#REF!"},{"$error":"#REF!"},{"$error":"#REF!"},{"$error":"#REF!"},0,{"$error":"#REF!"},null,"N/A","6-10"]
[null,null,"LB2",9026,{"$error":"#REF!"},{"$error":"#REF!"},{"$error":"#REF!"},{"$error":"#REF!"},{"$error":"#REF!"},0,{"$error":"#REF!"},null,"N/A","2-5"]
[null,null,"LB1",9025,{"$error":"#REF!"},{"$error":"#REF!"},{"$error":"#REF!"},{"$error":"#REF!"},{"$error":"#REF!"},0,{"$error":"#REF!"},null,"N/A","2-5"]
[null,"Clinically Complex","CE2",9024,{"$error":"#REF!"},{"$error":"#REF!"},{"$error":"#REF!"},{"$error":"#REF!"},{"$error":"#REF!"},0,{"$error":"#REF!"},null,"N/A","15-16"]
[null,null,"CE1",9023,{"$error":"#REF!"},{"$error":"#REF!"},{"$error":"#REF!"},{"$error":"#REF!"},{"$error":"#REF!"},0,{"$error":"#REF!"},null,"N/A","15-16"]
[null,null,"CD2",9022,{"$error":"#REF!"},{"$error":"#REF!"},{"$error":"#REF!"},{"$error":"#REF!"},{"$error":"#REF!"},0,{"$error":"#REF!"},null,"N/A","11-14"]
[null,null,"CD1",9021,{"$error":"#REF!"},{"$error":"#REF!"},{"$error":"#REF!"},{"$error":"#REF!"},{"$error":"#REF!"},0,{"$error":"#REF!"},null,"N/A","11-14"]
[null,null,"CC2",9020,{"$error":"#REF!"},{"$error":"#REF!"},{"$error":"#REF!"},{"$error":"#REF!"},{"$error":"#REF!"},0,{"$error":"#REF!"},null,"N/A","6-10"]
[null,null,"CC1",9019,{"$error":"#REF!"},{"$error":"#REF!"},{"$error":"#REF!"},{"$error":"#REF!"},{"$error":"#REF!"},0,{"$error":"#REF!"},null,"N/A","6-10"]
[null,null,"CB2",9018,{"$error":"#REF!"},{"$error":"#REF!"},{"$error":"#REF!"},{"$error":"#REF!"},{"$error":"#REF!"},0,{"$error":"#REF!"},null,"N/A","2-5"]
[null,null,"CB1",9017,{"$error":"#REF!"},{"$error":"#REF!"},{"$error":"#REF!"},{"$error":"#REF!"},{"$error":"#REF!"},0,{"$error":"#REF!"},null,"N/A","2-5"]
[null,null,"CA2",9016,{"$error":"#REF!"},{"$error":"#REF!"},{"$error":"#REF!"},{"$error":"#REF!"},{"$error":"#REF!"},0,{"$error":"#REF!"},null,"N/A","0-1"]
[null,null,"CA1",9015,{"$error":"#REF!"},{"$error":"#REF!"},{"$error":"#REF!"},{"$error":"#REF!"},{"$error":"#REF!"},0,{"$error":"#REF!"},null,"N/A","0-1"]
[null,"Behavior Symptoms &  Cognitive Performance","BB2",9014,{"$error":"#REF!"},{"$error":"#REF!"},{"$error":"#REF!"},{"$error":"#REF!"},{"$error":"#REF!"},0,{"$error":"#REF!"},null,"N/A","2-5"]
[null,null,"BB1",9013,{"$error":"#REF!"},{"$error":"#REF!"},{"$error":"#REF!"},{"$error":"#REF!"},{"$error":"#REF!"},0,{"$error":"#REF!"},null,"N/A","2-5"]
[null,null,"BA2",9012,{"$error":"#REF!"},{"$error":"#REF!"},{"$error":"#REF!"},{"$error":"#REF!"},{"$error":"#REF!"},0,{"$error":"#REF!"},null,"N/A","0-1"]
[null,null,"BA1",9011,{"$error":"#REF!"},{"$error":"#REF!"},{"$error":"#REF!"},{"$error":"#REF!"},{"$error":"#REF!"},0,{"$error":"#REF!"},null,"N/A","0-1"]
[null,"Reduced Physical Function","PE2",9010,{"$error":"#REF!"},{"$error":"#REF!"},{"$error":"#REF!"},{"$error":"#REF!"},{"$error":"#REF!"},0,{"$error":"#REF!"},null,"N/A","15-16"]
[null,null,"PE1",9009,{"$error":"#REF!"},{"$error":"#REF!"},{"$error":"#REF!"},{"$error":"#REF!"},{"$error":"#REF!"},0,{"$error":"#REF!"},null,"N/A","15-16"]
[null,null,"PD2",9008,{"$error":"#REF!"},{"$error":"#REF!"},{"$error":"#REF!"},{"$error":"#REF!"},{"$error":"#REF!"},0,{"$error":"#REF!"},null,"N/A","11-14"]
[null,null,"PD1",9007,{"$error":"#REF!"},{"$error":"#REF!"},{"$error":"#REF!"},{"$error":"#REF!"},{"$error":"#REF!"},0,{"$error":"#REF!"},null,"N/A","11-14"]
[null,null,"PC2",9006,{"$error":"#REF!"},{"$error":"#REF!"},{"$error":"#REF!"},{"$error":"#REF!"},{"$error":"#REF!"},0,{"$error":"#REF!"},null,"N/A","6-10"]
[null,null,"PC1",9005,{"$error":"#REF!"},{"$error":"#REF!"},{"$error":"#REF!"},{"$error":"#REF!"},{"$error":"#REF!"},0,{"$error":"#REF!"},null,"N/A","6-10"]
[null,null,"PB2",9004,{"$error":"#REF!"},{"$error":"#REF!"},{"$error":"#REF!"},{"$error":"#REF!"},{"$error":"#REF!"},0,{"$error":"#REF!"},null,"N/A","2-5"]
[null,null,"PB1",9003,{"$error":"#REF!"},{"$error":"#REF!"},{"$error":"#REF!"},{"$error":"#REF!"},{"$error":"#REF!"},0,{"$error":"#REF!"},null,"N/A","2-5"]
[null,null,"PA2",9002,{"$error":"#REF!"},{"$error":"#REF!"},{"$error":"#REF!"},{"$error":"#REF!"},{"$error":"#REF!"},0,{"$error":"#REF!"},null,"N/A","0-1"]
[null,null,"PA1/Default",9001,{"$f":"IF($C$12=\"Select County\",0,VLOOKUP(CONCATENATE(\"PA1\",\"-\",LEFT($C$16,1)),Rates,3,FALSE))","v":{"$error":"#REF!"}},{"$f":"IF($C$15=\"Select County\",0,$C$15)","v":{"$error":"#REF!"}},{"$error":"#REF!"},{"$f":"IF($C$12=\"Select County\",0,VLOOKUP(CONCATENATE(\"PA1\",\"-\",LEFT($C$16,1)),Rates,4,FALSE))","v":{"$error":"#REF!"}},{"$f":"ROUND(G94+H94,2)","v":{"$error":"#REF!"}},{"$f":"IF(F$18=\"Y\",ROUND(I94*1.28,2),0)","v":0},{"$f":"ROUND(I94+J94,2)","v":{"$error":"#REF!"}},null,"N/A","0-1"]
[]
[null,{"$f":"CONCATENATE(\"* \",Source!B2,\", \",Source!B3,\", \",Source!B4,\", \",Source!B5,\", \",Source!B6,\".\")","v":"* , CMS-1696-F and CMS-1696-CN, Medicare Program: Prospective Payment System and Consolidated Billing for Skilled Nursing Facilities for FY 2019, Skilled Nursing Facilities Value-Based Purchasing Program, etc., Filed 7/31/2018, Published 8/8/2018."}]
[]
[]
[null,"©2016, 2017, 2018 CliftonLarsonallen LLP All Rights Reserved"]

{"sheet":"Data - Rates","index":17,"n_rows":137,"n_cols":29,"rows_kept":137,"cut":false,"hidden":true,"merged":[]}
["Labor Index",0.70499999999999996,null,null,null,null,null,null,null,null,null,null,null,null,null,"Enter unadjusted federal rates from Federal Register here:","U",null,null,181.44,136.66999999999999,18,92.6]
["Non-Labor Index",{"$f":"1-B1","v":0.29500000000000004},null,null,null,null,null,null,null,null,null,null,null,null,null,null,"R",null,null,173.34,157.6,19.23,94.31]
[]
["RUG Category","Federal Rate","Labor Rate","Non-Labor Rate",null,null,null,null,null,null,null,null,null,null,null,null,"RUG Category","NI","TI","NC","TC","NCMTC","NCMC","Totsl",null,null,null,"FYP2019","FYF2018"]
["RUX-R",851.83999999999992,{"$f":"ROUND(B5*$B$1,2)","v":600.54999999999995},{"$f":"ROUND(B5-C5,2)","v":251.29},null,"RUX",851.83999999999992,600.54999999999995,251.29,{"$f":"H5/G5","v":0.70500328700225401},null,null,null,null,null,null,"RUX-R",2.67,1.87,{"$f":"ROUND(IF(RIGHT($Q5,1)=\"R\",T$2*R5,T$1*R5),2)","v":462.82},294.70999999999998,null,{"$f":"+$W$2","v":94.31},{"$f":"SUM(T5:W5)","v":851.83999999999992},null,null,"RUX-R",851.83999999999992,832.18999999999994]
["RUL-R",834.5,{"$f":"ROUND(B6*$B$1,2)","v":588.32000000000005},{"$f":"ROUND(B6-C6,2)","v":246.18},null,"RUL",834.5,588.32000000000005,246.18,0.70499700419412825,null,null,null,null,null,null,"RUL-R",2.57,1.87,445.48,294.70999999999998,null,{"$f":"+$W$2","v":94.31},{"$f":"SUM(T6:W6)","v":834.5},null,null,"RUL-R",834.5,815.25]
["RVX-R",748.46,527.66,220.8,null,"RVX",748.46,527.66,220.8,0.70499425486999967,null,null,null,null,null,null,"RVX-R",2.61,1.28,452.42,201.73,null,94.31,748.46,null,null,"RVX-R",748.46,731.18999999999994]
["RVL-R",675.65000000000009,476.33,199.32,null,"RVL",675.65000000000009,476.33,199.32,0.70499518981721299,null,null,null,null,null,null,"RVL-R",2.19,1.28,379.61,201.73,null,94.31,675.65000000000009,null,null,"RVL-R",675.65000000000009,660.06000000000006]
["RHX-R",670.29,472.55,197.74,null,"RHX",670.29,472.55,197.74,0.70499336108251653,null,null,null,null,null,null,"RHX-R",2.5499999999999998,0.85,442.02,133.96,null,94.31,670.29,null,null,"RHX-R",670.29,654.83000000000004]
["RHL-R",600.95000000000005,423.67,177.28,null,"RHL",600.95000000000005,423.67,177.28,0.70500041600798735,null,null,null,null,null,null,"RHL-R",2.15,0.85,372.68,133.96,null,94.31,600.95000000000005,null,null,"RHL-R",600.95000000000005,587.09]
["RMX-R",609.13999999999987,429.44,179.7,null,"RMX",609.13999999999987,429.44,179.7,0.70499392586269183,null,null,null,null,null,null,"RMX-R",2.4700000000000002,0.55000000000000004,428.15,86.68,null,94.31,609.13999999999987,null,null,"RMX-R",609.13999999999987,595.09]
["RML-R",560.6,395.22,165.38,null,"RML",560.6,395.22,165.38,0.70499464859079564,null,null,null,null,null,null,"RML-R",2.19,0.55000000000000004,379.61,86.68,null,94.31,560.6,null,null,"RML-R",560.6,547.67000000000007]
["RLX-R",530.19000000000005,373.78,156.41,null,"RLX",530.19000000000005,373.78,156.41,0.7049925498406231,null,null,null,null,null,null,"RLX-R",2.2599999999999998,0.28000000000000003,391.75,44.13,null,94.31,530.19000000000005,null,null,"RLX-R",530.19000000000005,517.96]
["RUC-R",659.43000000000006,464.9,194.53,null,"RUC",659.43000000000006,464.9,194.53,0.70500280545319427,null,null,null,null,null,null,"RUC-R",1.56,1.87,270.41000000000003,294.70999999999998,null,94.31,659.43000000000006,null,null,"RUC-R",659.43000000000006,644.22]
["RUB-R",659.43000000000006,464.9,194.53,null,"RUB",659.43000000000006,464.9,194.53,0.70500280545319427,null,null,null,null,null,null,"RUB-R",1.56,1.87,270.41000000000003,294.70999999999998,null,94.31,659.43000000000006,null,null,"RUB-R",659.43000000000006,644.22]
["RUA-R",560.63,395.24,165.39,null,"RUA",560.63,395.24,165.39,0.70499259761339927,null,null,null,null,null,null,"RUA-R",0.99,1.87,171.61,294.70999999999998,null,94.31,560.63,null,null,"RUA-R",560.63,547.70000000000005]
["RVC-R",557.78,393.23,164.55,null,"RVC",557.78,393.23,164.55,0.70499121517444163,null,null,null,null,null,null,"RVC-R",1.51,1.28,261.74,201.73,null,94.31,557.78,null,null,"RVC-R",557.78,544.91]
["RVB-R",488.45,344.36,144.09,null,"RVB",488.45,344.36,144.09,0.70500563005425332,null,null,null,null,null,null,"RVB-R",1.1100000000000001,1.28,192.41,201.73,null,94.31,488.45,null,null,"RVB-R",488.45,477.17999999999995]
["RVA-R",486.71,343.13,143.58000000000001,null,"RVA",486.71,343.13,143.58000000000001,0.70499886996363337,null,null,null,null,null,null,"RVA-R",1.1000000000000001,1.28,190.67,201.73,null,94.31,486.71,null,null,"RVA-R",486.71,475.48]
["RHC-R",479.61,338.13,141.47999999999999,null,"RHC",479.61,338.13,141.47999999999999,0.70501032088571958,null,null,null,null,null,null,"RHC-R",1.45,0.85,251.34,133.96,null,94.31,479.61,null,null,"RHC-R",479.61,468.54999999999995]
["RHB-R",434.54,306.35000000000002,128.19,null,"RHB",434.54,306.35000000000002,128.19,0.70499838910111845,null,null,null,null,null,null,"RHB-R",1.19,0.85,206.27,133.96,null,94.31,434.54,null,null,"RHB-R",434.54,424.52]
["RHA-R",386.01000000000005,272.14,113.87,null,"RHA",386.01000000000005,272.14,113.87,0.70500764228905977,null,null,null,null,null,null,"RHA-R",0.91,0.85,157.74,133.96,null,94.31,386.01000000000005,null,null,"RHA-R",386.01000000000005,377.11]
["RMC-R",416.73,293.79000000000002,122.94,null,"RMC",416.73,293.79000000000002,122.94,0.70498884169606224,null,null,null,null,null,null,"RMC-R",1.36,0.55000000000000004,235.74,86.68,null,94.31,416.73,null,null,"RMC-R",416.73,407.12]
["RMB-R",392.46,276.68,115.78,null,"RMB",392.46,276.68,115.78,0.70498904346939817,null,null,null,null,null,null,"RMB-R",1.22,0.55000000000000004,211.47,86.68,null,94.31,392.46,null,null,"RMB-R",392.46,383.40999999999997]
["RMA-R",326.60000000000002,230.25,96.35,null,"RMA",326.60000000000002,230.25,96.35,0.7049908144519289,null,null,null,null,null,null,"RMA-R",0.84,0.55000000000000004,145.61000000000001,86.68,null,94.31,326.60000000000002,null,null,"RMA-R",326.60000000000002,319.07]
["RLB-R",398.45,280.91000000000003,117.54,null,"RLB",398.45,280.91000000000003,117.54,0.70500690174425906,null,null,null,null,null,null,"RLB-R",1.5,0.28000000000000003,260.01,44.13,null,94.31,398.45,null,null,"RLB-R",398.45,389.26]
["RLA-R",261.51,184.36,77.150000000000006,null,"RLA",261.51,184.36,77.150000000000006,0.70498260104776111,null,null,null,null,null,null,"RLA-R",0.71,0.28000000000000003,123.07,44.13,null,94.31,261.51,null,null,"RLA-R",261.51,255.48000000000002]
["ES3-R",734.09999999999991,517.54,216.56,null,"ES3",734.09999999999991,517.54,216.56,0.70499931889388368,null,null,null,null,null,null,"ES3-R",3.58,null,620.55999999999995,0,{"$f":"+$V$2","v":19.23},94.31,734.09999999999991,null,null,"ES3-R",734.09999999999991,717.17]
["ES2-R",576.36,406.33,170.03,null,"ES2",576.36,406.33,170.03,0.70499340689846623,null,null,null,null,null,null,"ES2-R",2.67,null,462.82,0,{"$f":"+$V$2","v":19.23},94.31,576.36,null,null,"ES2-R",576.36,563.07000000000005]
["ES1-R",515.69000000000005,363.56,152.13,null,"ES1",515.69000000000005,363.56,152.13,0.70499718823324087,null,null,null,null,null,null,"ES1-R",2.3199999999999998,null,402.15,0,19.23,94.31,515.69000000000005,null,null,"ES1-R",515.69000000000005,503.8]
["HE2-R",498.35,351.34,147.01,null,"HE2",498.35,351.34,147.01,0.70500652152101928,null,null,null,null,null,null,"HE2-R",2.2200000000000002,null,384.81,0,19.23,94.31,498.35,null,null,"HE2-R",498.35,486.86]
["HE1-R",415.15000000000003,292.68,122.47,null,"HE1",415.15000000000003,292.68,122.47,0.70499819342406356,null,null,null,null,null,null,"HE1-R",1.74,null,301.61,0,19.23,94.31,415.15000000000003,null,null,"HE1-R",415.15000000000003,405.58]
["HD2-R",467.15000000000003,329.34,137.81,null,"HD2",467.15000000000003,329.34,137.81,0.70499839451996138,null,null,null,null,null,null,"HD2-R",2.04,null,353.61,0,19.23,94.31,467.15000000000003,null,null,"HD2-R",467.15000000000003,456.38]
["HD1-R",390.88,275.57,115.31,null,"HD1",390.88,275.57,115.31,0.70499897666803113,null,null,null,null,null,null,"HD1-R",1.6,null,277.33999999999997,0,19.23,94.31,390.88,null,null,"HD1-R",390.88,381.87]
["HC2-R",441.15000000000003,311.01,130.13999999999999,null,"HC2",441.15000000000003,311.01,130.13999999999999,0.70499829989799379,null,null,null,null,null,null,"HC2-R",1.89,null,327.61,0,19.23,94.31,441.15000000000003,null,null,"HC2-R",441.15000000000003,430.98]
["HC1-R",370.08000000000004,260.91000000000003,109.17,null,"HC1",370.08000000000004,260.91000000000003,109.17,0.70500972762645908,null,null,null,null,null,null,"HC1-R",1.48,null,256.54000000000002,0,19.23,94.31,370.08000000000004,null,null,"HC1-R",370.08000000000004,361.55]
["HB2-R",435.95000000000005,307.33999999999997,128.61000000000001,null,"HB2",435.95000000000005,307.33999999999997,128.61000000000001,0.70498910425507499,null,null,null,null,null,null,"HB2-R",1.86,null,322.41000000000003,0,19.23,94.31,435.95000000000005,null,null,"HB2-R",435.95000000000005,425.90000000000003]
["HB1-R",366.62,258.47000000000003,108.15,null,"HB1",366.62,258.47000000000003,108.15,0.70500791009764885,null,null,null,null,null,null,"HB1-R",1.46,null,253.08,0,19.23,94.31,366.62,null,null,"HB1-R",366.62,358.17]
["LE2-R",453.29,319.57,133.72,null,"LE2",453.29,319.57,133.72,0.70500121335127619,null,null,null,null,null,null,"LE2-R",1.96,null,339.75,0,19.23,94.31,453.29,null,null,"LE2-R",453.29,442.84000000000003]
["LE1-R",380.48,268.24,112.24,null,"LE1",380.48,268.24,112.24,0.70500420521446594,null,null,null,null,null,null,"LE1-R",1.54,null,266.94,0,19.23,94.31,380.48,null,null,"LE1-R",380.48,371.71]
["LD2-R",435.95000000000005,307.33999999999997,128.61000000000001,null,"LD2",435.95000000000005,307.33999999999997,128.61000000000001,0.70498910425507499,null,null,null,null,null,null,"LD2-R",1.86,null,322.41000000000003,0,19.23,94.31,435.95000000000005,null,null,"LD2-R",435.95000000000005,425.90000000000003]
["LD1-R",366.62,258.47000000000003,108.15,null,"LD1",366.62,258.47000000000003,108.15,0.70500791009764885,null,null,null,null,null,null,"LD1-R",1.46,null,253.08,0,19.23,94.31,366.62,null,null,"LD1-R",366.62,358.17]
["LC2-R",383.95000000000005,270.68,113.27,null,"LC2",383.95000000000005,270.68,113.27,0.70498762859747355,null,null,null,null,null,null,"LC2-R",1.56,null,270.41000000000003,0,19.23,94.31,383.95000000000005,null,null,"LC2-R",383.95000000000005,375.1]
["LC1-R",325.01,229.13,95.88,null,"LC1",325.01,229.13,95.88,0.70499369250176913,null,null,null,null,null,null,"LC1-R",1.22,null,211.47,0,19.23,94.31,325.01,null,null,"LC1-R",325.01,317.52]
["LB2-R",364.88,257.24,107.64,null,"LB2",364.88,257.24,107.64,0.70499890374917784,null,null,null,null,null,null,"LB2-R",1.45,null,251.34,0,19.23,94.31,364.88,null,null,"LB2-R",364.88,356.46999999999997]
["LB1-R",311.14999999999998,219.36,91.79,null,"LB1",311.14999999999998,219.36,91.79,0.70499758958701597,null,null,null,null,null,null,"LB1-R",1.1399999999999999,null,197.61,0,19.23,94.31,311.14999999999998,null,null,"LB1-R",311.14999999999998,303.98]
["CE2-R",404.75,285.35000000000002,119.4,null,"CE2",404.75,285.35000000000002,119.4,0.70500308832612735,null,null,null,null,null,null,"CE2-R",1.68,null,291.20999999999998,0,19.23,94.31,404.75,null,null,"CE2-R",404.75,395.42]
["CE1-R",373.55,263.35000000000002,110.2,null,"CE1",373.55,263.35000000000002,110.2,0.70499263820104408,null,null,null,null,null,null,"CE1-R",1.5,null,260.01,0,19.23,94.31,373.55,null,null,"CE1-R",373.55,364.94]
["CD2-R",383.95000000000005,270.68,113.27,null,"CD2",383.95000000000005,270.68,113.27,0.70498762859747355,null,null,null,null,null,null,"CD2-R",1.56,null,270.41000000000003,0,19.23,94.31,383.95000000000005,null,null,"CD2-R",383.95000000000005,375.1]
["CD1-R",352.75,248.69,104.06,null,"CD1",352.75,248.69,104.06,0.70500354358610917,null,null,null,null,null,null,"CD1-R",1.38,null,239.21,0,19.23,94.31,352.75,null,null,"CD1-R",352.75,344.62]
["CC2-R",337.15,237.69,99.46,null,"CC2",337.15,237.69,99.46,0.70499777547085873,null,null,null,null,null,null,"CC2-R",1.29,null,223.61,0,19.23,94.31,337.15,null,null,"CC2-R",337.15,329.38]
["CC1-R",312.88,220.58,92.3,null,"CC1",312.88,220.58,92.3,0.70499872155458965,null,null,null,null,null,null,"CC1-R",1.1499999999999999,null,199.34,0,19.23,94.31,312.88,null,null,"CC1-R",312.88,305.67]
["CB2-R",312.88,220.58,92.3,null,"CB2",312.88,220.58,92.3,0.70499872155458965,null,null,null,null,null,null,"CB2-R",1.1499999999999999,null,199.34,0,19.23,94.31,312.88,null,null,"CB2-R",312.88,305.67]
["CB1-R",290.35000000000002,204.7,85.65,null,"CB1",290.35000000000002,204.7,85.65,0.70501119338729112,null,null,null,null,null,null,"CB1-R",1.02,null,176.81,0,19.23,94.31,290.35000000000002,null,null,"CB1-R",290.35000000000002,283.65999999999997]
["CA2-R",266.08,187.59,78.489999999999995,null,"CA2",266.08,187.59,78.489999999999995,0.70501352976548415,null,null,null,null,null,null,"CA2-R",0.88,null,152.54,0,19.23,94.31,266.08,null,null,"CA2-R",266.08,259.95]
["CA1-R",248.75,175.37,73.38,null,"CA1",248.75,175.37,73.38,0.70500502512562813,null,null,null,null,null,null,"CA1-R",0.78,null,135.21,0,19.23,94.31,248.75,null,null,"CA1-R",248.75,243.01999999999998]
["BB2-R",281.67999999999995,198.58,83.1,null,"BB2",281.67999999999995,198.58,83.1,0.7049843794376599,null,null,null,null,null,null,"BB2-R",0.97,null,168.14,0,19.23,94.31,281.67999999999995,null,null,"BB2-R",281.67999999999995,275.19]
["BB1-R",269.54999999999995,190.03,79.52,null,"BB1",269.54999999999995,190.03,79.52,0.70498979781116689,null,null,null,null,null,null,"BB1-R",0.9,null,156.01,0,19.23,94.31,269.54999999999995,null,null,"BB1-R",269.54999999999995,263.33999999999997]
["BA2-R",234.88,165.59,69.290000000000006,null,"BA2",234.88,165.59,69.290000000000006,0.70499829700272487,null,null,null,null,null,null,"BA2-R",0.7,null,121.34,0,19.23,94.31,234.88,null,null,"BA2-R",234.88,229.47000000000003]
["BA1-R",224.48,158.26,66.22,null,"BA1",224.48,158.26,66.22,0.70500712758374906,null,null,null,null,null,null,"BA1-R",0.64,null,110.94,0,19.23,94.31,224.48,null,null,"BA1-R",224.48,219.31]
["PE2-R",373.55,263.35000000000002,110.2,null,"PE2",373.55,263.35000000000002,110.2,0.70499263820104408,null,null,null,null,null,null,"PE2-R",1.5,null,260.01,0,19.23,94.31,373.55,null,null,"PE2-R",373.55,364.94]
["PE1-R",356.22,251.14,105.08,null,"PE1",356.22,251.14,105.08,0.70501375554432644,null,null,null,null,null,null,"PE1-R",1.4,null,242.68,0,19.23,94.31,356.22,null,null,"PE1-R",356.22,348.01]
["PD2-R",352.75,248.69,104.06,null,"PD2",352.75,248.69,104.06,0.70500354358610917,null,null,null,null,null,null,"PD2-R",1.38,null,239.21,0,19.23,94.31,352.75,null,null,"PD2-R",352.75,344.62]
["PD1-R",335.41999999999996,236.47,98.95,null,"PD1",335.41999999999996,236.47,98.95,0.70499672052948548,null,null,null,null,null,null,"PD1-R",1.28,null,221.88,0,19.23,94.31,335.41999999999996,null,null,"PD1-R",335.41999999999996,327.69]
["PC2-R",304.20999999999998,214.47,89.74,null,"PC2",304.20999999999998,214.47,89.74,0.7050064100456922,null,null,null,null,null,null,"PC2-R",1.1000000000000001,null,190.67,0,19.23,94.31,304.20999999999998,null,null,"PC2-R",304.20999999999998,297.2]
["PC1-R",290.35000000000002,204.7,85.65,null,"PC1",290.35000000000002,204.7,85.65,0.70501119338729112,null,null,null,null,null,null,"PC1-R",1.02,null,176.81,0,19.23,94.31,290.35000000000002,null,null,"PC1-R",290.35000000000002,283.65999999999997]
["PB2-R",259.14999999999998,182.7,76.45,null,"PB2",259.14999999999998,182.7,76.45,0.70499710592321052,null,null,null,null,null,null,"PB2-R",0.84,null,145.61000000000001,0,19.23,94.31,259.14999999999998,null,null,"PB2-R",259.14999999999998,253.18]
["PB1-R",248.75,175.37,73.38,null,"PB1",248.75,175.37,73.38,0.70500502512562813,null,null,null,null,null,null,"PB1-R",0.78,null,135.21,0,19.23,94.31,248.75,null,null,"PB1-R",248.75,243.01999999999998]
["PA2-R",215.81,152.15,63.66,null,"PA2",215.81,152.15,63.66,{"$f":"H69/G69","v":0.70501830313701874},null,null,null,null,null,null,"PA2-R",0.59,null,{"$f":"ROUND(IF(RIGHT($Q69,1)=\"R\",T$2*R69,T$1*R69),2)","v":102.27},0,19.23,94.31,215.81,null,null,"PA2-R",215.81,210.83999999999997]
["PA1-R",207.14,{"$f":"ROUND(B70*$B$1,2)","v":146.03},{"$f":"ROUND(B70-C70,2)","v":61.11},null,"PA1",207.14,146.03,61.11,{"$f":"H70/G70","v":0.70498213768465778},null,null,null,null,null,null,"PA1-R",0.54,null,93.6,0,19.23,{"$f":"+$W$2","v":94.31},{"$f":"SUM(T70:W70)","v":207.14},null,null,"PA1-R",207.14,202.37]
["RUX-U",832.61,586.99,245.62,null,"RUX",832.61,586.99,245.62,{"$f":"H71/G71","v":0.7049999399478748},null,null,null,null,null,null,"RUX-U",2.67,1.87,484.44,255.57,null,{"$f":"$W$1","v":92.6},832.61,null,null,"RUX-U",832.61,813.43000000000006]
["RUL-U",814.47,574.20000000000005,240.27,null,"RUL",814.47,574.20000000000005,240.27,{"$f":"H72/G72","v":0.70499834248038606},null,null,null,null,null,null,"RUL-U",2.57,1.87,466.3,255.57,null,{"$f":"$W$1","v":92.6},814.47,null,null,"RUL-U",814.47,795.71]
["RVX-U",741.1,522.48,218.62,null,"RVX",741.1,522.48,218.62,0.70500607205505328,null,null,null,null,null,null,"RVX-U",2.61,1.28,473.56,174.94,null,92.6,741.1,null,null,"RVX-U",741.1,724.03]
["RVL-U",664.89,468.75,196.14,null,"RVL",664.89,468.75,196.14,0.70500383522086363,null,null,null,null,null,null,"RVL-U",2.19,1.28,397.35,174.94,null,92.6,664.89,null,null,"RVL-U",664.89,649.58000000000004]
["RHX-U",671.44,473.37,198.07,null,"RHX",671.44,473.37,198.07,0.70500714881448823,null,null,null,null,null,null,"RHX-U",2.5499999999999998,0.85,462.67,116.17,null,92.6,671.44,null,null,"RHX-U",671.44,655.97]
["RHL-U",598.87,422.2,176.67,null,"RHL",598.87,422.2,176.67,0.70499440613154774,null,null,null,null,null,null,"RHL-U",2.15,0.85,390.1,116.17,null,92.6,598.87,null,null,"RHL-U",598.87,585.07000000000005]
["RMX-U",615.93000000000006,434.23,181.7,null,"RMX",615.93000000000006,434.23,181.7,0.70499894468527269,null,null,null,null,null,null,"RMX-U",2.4700000000000002,0.55000000000000004,448.16,75.17,null,92.6,615.93000000000006,null,null,"RMX-U",615.93000000000006,601.74]
["RML-U",565.12,398.41,166.71,null,"RML",565.12,398.41,166.71,0.7050007078142696,null,null,null,null,null,null,"RML-U",2.19,0.55000000000000004,397.35,75.17,null,92.6,565.12,null,null,"RML-U",565.12,552.11]
["RLX-U",540.91999999999996,381.35,159.57,null,"RLX",540.91999999999996,381.35,159.57,0.70500258818309558,null,null,null,null,null,null,"RLX-U",2.2599999999999998,0.28000000000000003,410.05,38.270000000000003,null,92.6,540.91999999999996,null,null,"RLX-U",540.91999999999996,528.47]
["RUC-U",631.22,445.01,186.21,null,"RUC",631.22,445.01,186.21,0.70499984157662932,null,null,null,null,null,null,"RUC-U",1.56,1.87,283.05,255.57,null,92.6,631.22,null,null,"RUC-U",631.22,616.68000000000006]
["RUB-U",631.22,445.01,186.21,null,"RUB",631.22,445.01,186.21,0.70499984157662932,null,null,null,null,null,null,"RUB-U",1.56,1.87,283.05,255.57,null,92.6,631.22,null,null,"RUB-U",631.22,616.68000000000006]
["RUA-U",527.79999999999995,372.1,155.69999999999999,null,"RUA",527.79999999999995,372.1,155.69999999999999,0.7050018946570672,null,null,null,null,null,null,"RUA-U",0.99,1.87,179.63,255.57,null,92.6,527.79999999999995,null,null,"RUA-U",527.79999999999995,515.64]
["RVC-U",541.51,381.76,159.75,null,"RVC",541.51,381.76,159.75,0.7049915975697586,null,null,null,null,null,null,"RVC-U",1.51,1.28,273.97000000000003,174.94,null,92.6,541.51,null,null,"RVC-U",541.51,529.04000000000008]
["RVB-U",468.94000000000005,330.6,138.34,null,"RVB",468.94000000000005,330.6,138.34,0.70499424233377406,null,null,null,null,null,null,"RVB-U",1.1100000000000001,1.28,201.4,174.94,null,92.6,468.94000000000005,null,null,"RVB-U",468.94000000000005,458.14]
["RVA-U",467.12,329.32,137.80000000000001,null,"RVA",467.12,329.32,137.80000000000001,0.70500085631101217,null,null,null,null,null,null,"RVA-U",1.1000000000000001,1.28,{"$f":"ROUND(IF(RIGHT($Q85,1)=\"R\",T$2*R85,T$1*R85),2)","v":199.58},174.94,null,92.6,467.12,null,null,"RVA-U",467.12,456.37]
["RHC-U",471.86,332.66,139.19999999999999,null,"RHC",471.86,332.66,139.19999999999999,0.70499724494553473,null,null,null,null,null,null,"RHC-U",1.45,0.85,263.08999999999997,116.17,null,92.6,471.86,null,null,"RHC-U",471.86,460.99]
["RHB-U",424.67999999999995,299.39999999999998,125.28,null,"RHB",424.67999999999995,299.39999999999998,125.28,0.70500141282848261,null,null,null,null,null,null,"RHB-U",1.19,0.85,215.91,116.17,null,92.6,424.67999999999995,null,null,"RHB-U",424.67999999999995,414.9]
["RHA-U",373.88,263.58999999999997,110.29,null,"RHA",373.88,263.58999999999997,110.29,0.7050123034128597,null,null,null,null,null,null,"RHA-U",0.91,0.85,165.11,116.17,null,92.6,373.88,null,null,"RHA-U",373.88,365.27]
["RMC-U",414.53,292.24,122.29,null,"RMC",414.53,292.24,122.29,0.70499119484717643,null,null,null,null,null,null,"RMC-U",1.36,0.55000000000000004,246.76,75.17,null,92.6,414.53,null,null,"RMC-U",414.53,404.98]
["RMB-U",389.13,274.33999999999997,114.79,null,"RMB",389.13,274.33999999999997,114.79,0.70500860894816642,null,null,null,null,null,null,"RMB-U",1.22,0.55000000000000004,221.36,75.17,null,92.6,389.13,null,null,"RMB-U",389.13,380.16999999999996]
["RMA-U",320.17999999999995,225.73,94.45,null,"RMA",320.17999999999995,225.73,94.45,0.70500968205384484,null,null,null,null,null,null,"RMA-U",0.84,0.55000000000000004,152.41,75.17,null,92.6,320.17999999999995,null,null,"RMA-U",320.17999999999995,312.81]
["RLB-U",403.03,284.14,118.89,null,"RLB",403.03,284.14,118.89,0.70500955263876142,null,null,null,null,null,null,"RLB-U",1.5,0.28000000000000003,272.16000000000003,38.270000000000003,null,92.6,403.03,null,null,"RLB-U",403.03,393.75]
["RLA-U",259.69,183.08,76.61,null,"RLA",259.69,183.08,76.61,0.70499441641957727,null,null,null,null,null,null,"RLA-U",0.71,0.28000000000000003,128.82,38.270000000000003,null,92.6,259.69,null,null,"RLA-U",259.69,253.71]
["ES3-U",760.16,535.91,224.25,null,"ES3",745.01,525.23,219.78,0.70499724835908251,null,null,null,null,null,null,"ES3-U",3.58,null,649.55999999999995,0,{"$f":"$V$1","v":18},92.6,760.16,null,null,"ES3-U",760.16,742.65000000000009]
["ES2-U",595.04,419.5,175.54,null,"ES2",583.75,411.54,172.21,0.70499357601713064,null,null,null,null,null,null,"ES2-U",2.67,null,484.44,0,{"$f":"$V$1","v":18},92.6,595.04,null,null,"ES2-U",595.04,581.33999999999992]
["ES1-U",531.54,374.74,156.80000000000001,null,"ES1",521.73,367.82,153.91,0.70500067084507312,null,null,null,null,null,null,"ES1-U",2.3199999999999998,null,420.94,0,18,92.6,531.54,null,null,"ES1-U",531.54,519.29999999999995]
["HE2-U",513.4,361.95,151.44999999999999,null,"HE2",504.01,355.33,148.68,0.70500585305847108,null,null,null,null,null,null,"HE2-U",2.2200000000000002,null,402.8,0,18,92.6,513.4,null,null,"HE2-U",513.4,501.57999999999993]
["HE1-U",426.30999999999995,300.55,125.76,null,"HE1",418.95000000000005,295.36,123.59,0.70500059672991999,null,null,null,null,null,null,"HE1-U",1.74,null,315.70999999999998,0,18,92.6,426.30999999999995,null,null,"HE1-U",426.30999999999995,416.49]
["HD2-U",480.74,338.92,141.82,null,"HD2",472.11,332.84,139.27000000000001,0.70500518946855595,null,null,null,null,null,null,"HD2-U",2.04,null,370.14,0,18,92.6,480.74,null,null,"HD2-U",480.74,469.66999999999996]
["HD1-U",400.9,282.63,118.27,null,"HD1",394.14,277.87,116.27,0.70500329832039377,null,null,null,null,null,null,"HD1-U",1.6,null,290.3,0,18,92.6,400.9,null,null,"HD1-U",400.9,391.67999999999995]
["HC2-U",453.52,319.73,133.79,null,"HC2",445.53,314.10000000000002,131.43,0.70500303009898335,null,null,null,null,null,null,"HC2-U",1.89,null,342.92,0,18,92.6,453.52,null,null,"HC2-U",453.52,443.07999999999993]
["HC1-U",379.13,267.29000000000002,111.84,null,"HC1",372.87,262.87,110,0.70499101563547617,null,null,null,null,null,null,"HC1-U",1.48,null,268.52999999999997,0,18,92.6,379.13,null,null,"HC1-U",379.13,370.4]
["HB2-U",448.08000000000004,315.89999999999998,132.18,null,"HB2",440.21000000000004,310.35000000000002,129.86000000000001,0.7050044297040049,null,null,null,null,null,null,"HB2-U",1.86,null,337.48,0,18,92.6,448.08000000000004,null,null,"HB2-U",448.08000000000004,437.76]
["HB1-U",375.5,264.73,110.77,null,"HB1",369.33000000000004,260.38,108.95,0.70500636287331109,null,null,null,null,null,null,"HB1-U",1.46,null,264.89999999999998,0,18,92.6,375.5,null,null,"HB1-U",375.5,366.86]
["LE2-U",466.22,328.69,137.53,null,"LE2",457.92999999999995,322.83999999999997,135.09,0.7049985805690826,null,null,null,null,null,null,"LE2-U",1.96,null,355.62,0,18,92.6,466.22,null,null,"LE2-U",466.22,455.49]
["LE1-U",390.02,274.95999999999998,115.06,null,"LE1",383.5,270.37,113.13,0.70500651890482402,null,null,null,null,null,null,"LE1-U",1.54,null,279.42,0,18,92.6,390.02,null,null,"LE1-U",390.02,381.03999999999996]
["LD2-U",448.08000000000004,315.89999999999998,132.18,null,"LD2",440.21000000000004,310.35000000000002,129.86000000000001,0.7050044297040049,null,null,null,null,null,null,"LD2-U",1.86,null,337.48,0,18,92.6,448.08000000000004,null,null,"LD2-U",448.08000000000004,437.76]
["LD1-U",375.5,264.73,110.77,null,"LD1",369.33000000000004,260.38,108.95,0.70500636287331109,null,null,null,null,null,null,"LD1-U",1.46,null,264.89999999999998,0,18,92.6,375.5,null,null,"LD1-U",375.5,366.86]
["LC2-U",393.65,277.52,116.13,null,"LC2",387.04999999999995,272.87,114.18,0.70499935408861913,null,null,null,null,null,null,"LC2-U",1.56,null,283.05,0,18,92.6,393.65,null,null,"LC2-U",393.65,384.58999999999992]
["LC1-U",331.96000000000004,234.03,97.93,null,"LC1",326.79999999999995,230.39,96.41,0.7049877600979193,null,null,null,null,null,null,"LC1-U",1.22,null,221.36,0,18,92.6,331.96000000000004,null,null,"LC1-U",331.96000000000004,324.32]
["LB2-U",373.68999999999994,263.45,110.24,null,"LB2",367.54999999999995,259.12,108.43,0.7049925180247586,null,null,null,null,null,null,"LB2-U",1.45,null,263.08999999999997,0,18,92.6,373.68999999999994,null,null,"LB2-U",373.68999999999994,365.08999999999992]
["LB1-U",317.44,223.8,93.64,null,"LB1",312.62,220.4,92.22,0.70500927643784783,null,null,null,null,null,null,"LB1-U",1.1399999999999999,null,206.84,0,18,92.6,317.44,null,null,"LB1-U",317.44,310.14]
["CE2-U",415.41999999999996,292.87,122.55,null,"CE2",408.30999999999995,287.86,120.45,0.70500355122333536,null,null,null,null,null,null,"CE2-U",1.68,null,304.82,0,18,92.6,415.41999999999996,null,null,"CE2-U",415.41999999999996,405.86]
["CE1-U",382.76,269.85000000000002,112.91,null,"CE1",376.41999999999996,265.38,111.04,0.70501036076722812,null,null,null,null,null,null,"CE1-U",1.5,null,272.16000000000003,0,18,92.6,382.76,null,null,"CE1-U",382.76,373.94999999999993]
["CD2-U",393.65,277.52,116.13,null,"CD2",387.04999999999995,272.87,114.18,0.70499935408861913,null,null,null,null,null,null,"CD2-U",1.56,null,283.05,0,18,92.6,393.65,null,null,"CD2-U",393.65,384.58999999999992]
["CD1-U",360.99,254.5,106.49,null,"CD1",355.15,250.38,104.77,0.70499788821624665,null,null,null,null,null,null,"CD1-U",1.38,null,250.39,0,18,92.6,360.99,null,null,"CD1-U",360.99,352.67999999999995]
["CC2-U",344.65999999999997,242.99,101.67,null,"CC2",339.2,239.14,100.06,0.70501179245283019,null,null,null,null,null,null,"CC2-U",1.29,null,234.06,0,18,92.6,344.65999999999997,null,null,"CC2-U",344.65999999999997,336.73]
["CC1-U",319.26,225.08,94.18,null,"CC1",314.39,221.64,92.75,0.70498425522440278,null,null,null,null,null,null,"CC1-U",1.1499999999999999,null,208.66,0,18,92.6,319.26,null,null,"CC1-U",319.26,311.90999999999997]
["CB2-U",319.26,225.08,94.18,null,"CB2",314.39,221.64,92.75,0.70498425522440278,null,null,null,null,null,null,"CB2-U",1.1499999999999999,null,208.66,0,18,92.6,319.26,null,null,"CB2-U",319.26,311.90999999999997]
["CB1-U",295.66999999999996,208.45,87.22,null,"CB1",291.35000000000002,205.4,85.95,0.7049939934786339,null,null,null,null,null,null,"CB1-U",1.02,null,185.07,0,18,92.6,295.66999999999996,null,null,"CB1-U",295.66999999999996,288.87]
["CA2-U",270.27,190.54,79.73,null,"CA2",266.53999999999996,187.91,78.63,0.70499737375253257,null,null,null,null,null,null,"CA2-U",0.88,null,159.66999999999999,0,18,92.6,270.27,null,null,"CA2-U",270.27,264.05]
["CA1-U",252.12,177.74,74.38,null,"CA1",248.82,175.42,73.400000000000006,0.7050076360421188,null,null,null,null,null,null,"CA1-U",0.78,null,141.52000000000001,0,18,92.6,252.12,null,null,"CA1-U",252.12,246.32]
["BB2-U",286.60000000000002,202.05,84.55,null,"BB2",282.49,199.16,83.33,0.70501610676484117,null,null,null,null,null,null,"BB2-U",0.97,null,176,0,18,92.6,286.60000000000002,null,null,"BB2-U",286.60000000000002,280]
["BB1-U",273.89999999999998,193.1,80.8,null,"BB1",270.09000000000003,190.41,79.680000000000007,0.70498722648006207,null,null,null,null,null,null,"BB1-U",0.9,null,163.30000000000001,0,18,92.6,273.89999999999998,null,null,"BB1-U",273.89999999999998,267.59000000000003]
["BA2-U",237.60999999999999,167.52,70.09,null,"BA2",234.65,165.43,69.22,0.70500745791604513,null,null,null,null,null,null,"BA2-U",0.7,null,127.01,0,18,92.6,237.60999999999999,null,null,"BA2-U",237.60999999999999,232.14]
["BA1-U",226.72,159.84,66.88,null,"BA1",224.01,157.93,66.08,0.70501316905495293,null,null,null,null,null,null,"BA1-U",0.64,null,116.12,0,18,92.6,226.72,null,null,"BA1-U",226.72,221.51]
["PE2-U",382.76,269.85000000000002,112.91,null,"PE2",376.41999999999996,265.38,111.04,0.70501036076722812,null,null,null,null,null,null,"PE2-U",1.5,null,272.16000000000003,0,18,92.6,382.76,null,null,"PE2-U",382.76,373.94999999999993]
["PE1-U",364.62,257.06,107.56,null,"PE1",358.69000000000005,252.88,105.81,0.70500989712565154,null,null,null,null,null,null,"PE1-U",1.4,null,254.02,0,18,92.6,364.62,null,null,"PE1-U",364.62,356.22]
["PD2-U",360.99,254.5,106.49,null,"PD2",355.15,250.38,104.77,0.70499788821624665,null,null,null,null,null,null,"PD2-U",1.38,null,250.39,0,18,92.6,360.99,null,null,"PD2-U",360.99,352.67999999999995]
["PD1-U",342.84000000000003,241.7,101.14,null,"PD1",337.43,237.89,99.54,0.70500548261861717,null,null,null,null,null,null,"PD1-U",1.28,null,232.24,0,18,92.6,342.84000000000003,null,null,"PD1-U",342.84000000000003,334.95]
["PC2-U",310.18,218.68,91.5,null,"PC2",305.52999999999997,215.4,90.13,0.70500441855136986,null,null,null,null,null,null,"PC2-U",1.1000000000000001,null,199.58,0,18,92.6,310.18,null,null,"PC2-U",310.18,303.05]
["PC1-U",295.66999999999996,208.45,87.22,null,"PC1",291.35000000000002,205.4,85.95,0.7049939934786339,null,null,null,null,null,null,"PC1-U",1.02,null,185.07,0,18,92.6,295.66999999999996,null,null,"PC1-U",295.66999999999996,288.87]
["PB2-U",263.01,185.42,77.59,null,"PB2",254.46,179.39,75.069999999999993,0.70498310146977905,null,null,null,null,null,null,"PB2-U",0.84,null,152.41,0,18,92.6,263.01,null,null,"PB2-U",263.01,256.96000000000004]
["PB1-U",252.12,{"$f":"ROUND(B134*$B$1,2)","v":177.74},{"$f":"ROUND(B134-C134,2)","v":74.38},null,"PB1",248.82,175.42,73.400000000000006,0.7050076360421188,null,null,null,null,null,null,"PB1-U",0.78,null,141.52000000000001,0,18,92.6,{"$f":"SUM(T134:W134)","v":252.12},null,null,"PB1-U",252.12,246.32]
["PA2-U",217.64999999999998,{"$f":"ROUND(B135*$B$1,2)","v":153.44},{"$f":"ROUND(B135-C135,2)","v":64.209999999999994},null,"PA2",215.14999999999998,151.68,63.47,0.70499651405995822,null,null,null,null,null,null,"PA2-U",0.59,null,107.05,0,18,92.6,{"$f":"SUM(T135:W135)","v":217.64999999999998},null,null,"PA2-U",217.64999999999998,212.64]
["PA1-U",208.57999999999998,{"$f":"ROUND(B136*$B$1,2)","v":147.05000000000001},{"$f":"ROUND(B136-C136,2)","v":61.53},null,"PA1",206.29,145.43,60.86,{"$f":"H136/G136","v":0.70497842842600233},null,null,null,null,null,null,"PA1-U",0.54,null,97.98,0,18,{"$f":"$W$1","v":92.6},{"$f":"SUM(T136:W136)","v":208.57999999999998},null,null,"PA1-U",208.57999999999998,203.78]
[null,null,null,null,null,null,{"$f":"SUM(G5:G136)","v":56004.72000000003},{"$f":"SUM(H5:H136)","v":39483.31},{"$f":"SUM(I5:I136)","v":16521.410000000014},{"$f":"+H137/G137","v":0.70499968574077287}]

{"sheet":"Data - CBSA Codes","index":18,"n_rows":3227,"n_cols":2,"rows_kept":3227,"cut":false,"hidden":true,"merged":[]}
["County, State","CBSA Code"]
["Click on the arrow to make your selection . . . "]
["Abbeville County, SC","99942"]
["Acadia Parish, LA","29180"]
["Accomack County, VA","99949"]
["Ada County, ID","14260"]
["Adair County, IA","99916"]
["Adair County, KY","99918"]
["Adair County, MO","99926"]
["Adair County, OK","99937"]
["Adams County, CO","19740"]
["Adams County, IA","99916"]
["Adams County, ID","99913"]
["Adams County, IL","99914"]
["Adams County, IN","99915"]
["Adams County, MS","99925"]
["Adams County, ND","99935"]
["Adams County, NE","99928"]
["Adams County, OH","99936"]
["Adams County, PA","23900"]
["Adams County, WA","99950"]
["Adams County, WI","99952"]
["Addison County, VT","99947"]
["Adjuntas Municipio, PR","99940"]
["Aguada Municipio, PR","10380"]
["Aguadilla Municipio, PR","10380"]
["Aguas Buenas Municipio, PR","41980"]
["Aibonito Municipio, PR","41980"]
["Aiken County, SC","12260"]
["Aitkin County, MN","99924"]
["Alachua County, FL","23540"]
["Alamance County, NC","15500"]
["Alameda County, CA","36084"]
["Alamosa County, CO","99906"]
["Albany County, NY","10580"]
["Albany County, WY","99953"]
["Albemarle County, VA","16820"]
["Alcona County, MI","99923"]
["Alcorn County, MS","99925"]
["Aleutians East Borough, AK","99902"]
["Aleutians West Borough, AK","99902"]
["Alexander County, IL","16020"]
["Alexander County, NC","25860"]
["Alexandria City County, VA","47894"]
["Alfalfa County, OK","99937"]
["Alger County, MI","99923"]
["Allamakee County, IA","99916"]
["Allegan County, MI","99923"]
["Allegany County, MD","19060"]
["Allegany County, NY","99933"]
["Alleghany County, NC","99934"]
["Alleghany County, VA","99949"]
["Allegheny County, PA","38300"]
["Allen County, IN","23060"]
["Allen County, KS","99917"]
["Allen County, KY","14540"]
["Allen County, LA","99919"]
["Allen County, OH","30620"]
["Allendale County, SC","99942"]
["Alpena County, MI","99923"]
["Alpine County, CA","99905"]
["Amador County, CA","99905"]
["Amelia County, VA","40060"]
["Amherst County, VA","31340"]
["Amite County, MS","99925"]
["Anasco Municipio, PR","10380"]
["Anchorage Municipality, AK","11260"]
["Anderson County, KS","99917"]
["Anderson County, KY","99918"]
["Anderson County, SC","24860"]
["Anderson County, TN","28940"]
["Anderson County, TX","99945"]
["Andrew County, MO","41140"]
["Andrews County, TX","99945"]
["Androscoggin County, ME","30340"]
["Angelina County, TX","99945"]
["Anne Arundel County, MD","12580"]
["Anoka County, MN","33460"]
["Anson County, NC","99934"]
["Antelope County, NE","99928"]
["Antrim County, MI","99923"]
["Apache County, AZ","99903"]
["Appanoose County, IA","99916"]
["Appling County, GA","99911"]
["Appomattox County, VA","31340"]
["Aransas County, TX","18580"]
["Arapahoe County, CO","19740"]
["Archer County, TX","48660"]
["Archuleta County, CO","99906"]
["Arecibo Municipio, PR","11640"]
["Arenac County, MI","99923"]
["Arkansas County, AR","99904"]
["Arlington County, VA","47894"]
["Armstrong County, PA","38300"]
["Armstrong County, TX","11100"]
["Aroostook County, ME","99920"]
["Arroyo Municipio, PR","25020"]
["Arthur County, NE","99928"]
["Ascension Parish, LA","12940"]
["Ashe County, NC","99934"]
["Ashland County, OH","99936"]
["Ashland County, WI","99952"]
["Ashley County, AR","99904"]
["Ashtabula County, OH","99936"]
["Asotin County, WA","30300"]
["Assumption Parish, LA","99919"]
["Atascosa County, TX","41700"]
["Atchison County, KS","99917"]
["Atchison County, MO","99926"]
["Athens County, OH","99936"]
["Atkinson County, GA","99911"]
["Atlantic County, NJ","12100"]
["Atoka County, OK","99937"]
["Attala County, MS","99925"]
["Audrain County, MO","99926"]
["Audubon County, IA","99916"]
["Auglaize County, OH","99936"]
["Augusta County, VA","44420"]
["Aurora County, SD","99943"]
["Austin County, TX","26420"]
["Autauga County, AL","33860"]
["Avery County, NC","99934"]
["Avoyelles Parish, LA","99919"]
["Baca County, CO","99906"]
["Bacon County, GA","99911"]
["Bailey County, TX","99945"]
["Baker County, FL","27260"]
["Baker County, GA","10500"]
["Baker County, OR","99938"]
["Baldwin County, AL","19300"]
["Baldwin County, GA","99911"]
["Ballard County, KY","99918"]
["Baltimore City, MD","12580"]
["Baltimore County, MD","12580"]
["Bamberg County, SC","99942"]
["Bandera County, TX","41700"]
["Banks County, GA","99911"]
["Banner County, NE","99928"]
["Bannock County, ID","38540"]
["Baraga County, MI","99923"]
["Barber County, KS","99917"]
["Barbour County, AL","99901"]
["Barbour County, WV","99951"]
["Barceloneta Municipio, PR","41980"]
["Barnes County, ND","99935"]
["Barnstable County, MA","12700"]
["Barnwell County, SC","99942"]
["Barranquitas Municipio, PR","41980"]
["Barren County, KY","99918"]
["Barron County, WI","99952"]
["Barrow County, GA","12060"]
["Barry County, MI","24340"]
["Barry County, MO","99926"]
["Bartholomew County, IN","18020"]
["Barton County, KS","99917"]
["Barton County, MO","99926"]
["Bartow County, GA","12060"]
["Bastrop County, TX","12420"]
["Bates County, MO","28140"]
["Bath County, KY","99918"]
["Bath County, VA","99949"]
["Baxter County, AR","99904"]
["Bay County, FL","37460"]
["Bay County, MI","13020"]
["Bayamon Municipio, PR","41980"]
["Bayfield County, WI","99952"]
["Baylor County, TX","99945"]
["Beadle County, SD","99943"]
["Bear Lake County, ID","99913"]
["Beaufort County, NC","99934"]
["Beaufort County, SC","25940"]
["Beauregard Parish, LA","99919"]
["Beaver County, OK","99937"]
["Beaver County, PA","38300"]
["Beaver County, UT","99946"]
["Beaverhead County, MT","99927"]
["Becker County, MN","99924"]
["Beckham County, OK","99937"]
["Bedford City County, VA","31340"]
["Bedford County, PA","99939"]
["Bedford County, TN","99944"]
["Bedford County, VA","31340"]
["Bee County, TX","99945"]
["Belknap County, NH","99930"]
["Bell County, KY","99918"]
["Bell County, TX","28660"]
["Belmont County, OH","48540"]
["Beltrami County, MN","99924"]
["Ben Hill County, GA","99911"]
["Benewah County, ID","99913"]
["Bennett County, SD","99943"]
["Bennington County, VT","99947"]
["Benson County, ND","99935"]
["Bent County, CO","99906"]
["Benton County, AR","22220"]
["Benton County, IA","16300"]
["Benton County, IN","29200"]
["Benton County, MN","41060"]
["Benton County, MO","99926"]
["Benton County, MS","32820"]
["Benton County, OR","18700"]
["Benton County, TN","99944"]
["Benton County, WA","28420"]
["Benzie County, MI","99923"]
["Bergen County, NJ","35614"]
["Berkeley County, SC","16700"]
["Berkeley County, WV","25180"]
["Berks County, PA","39740"]
["Berkshire County, MA","38340"]
["Bernalillo County, NM","10740"]
["Berrien County, GA","99911"]
["Berrien County, MI","35660"]
["Bertie County, NC","99934"]
["Bethel Borough, AK","99902"]
["Bexar County, TX","41700"]
["Bibb County, AL","13820"]
["Bibb County, GA","31420"]
["Bienville Parish, LA","99919"]
["Big Horn County, MT","99927"]
["Big Horn County, WY","99953"]
["Big Stone County, MN","99924"]
["Billings County, ND","99935"]
["Bingham County, ID","99913"]
["Black Hawk County, IA","47940"]
["Blackford County, IN","99915"]
["Bladen County, NC","99934"]
["Blaine County, ID","99913"]
["Blaine County, MT","99927"]
["Blaine County, NE","99928"]
["Blaine County, OK","99937"]
["Blair County, PA","11020"]
["Blanco County, TX","99945"]
["Bland County, VA","99949"]
["Bleckley County, GA","99911"]
["Bledsoe County, TN","99944"]
["Blount County, AL","13820"]
["Blount County, TN","28940"]
["Blue Earth County, MN","31860"]
["Boise County, ID","14260"]
["Bolivar County, MS","99925"]
["Bollinger County, MO","16020"]
["Bon Homme County, SD","99943"]
["Bond County, IL","41180"]
["Bonner County, ID","99913"]
["Bonneville County, ID","26820"]
["Boone County, AR","99904"]
["Boone County, IA","99916"]
["Boone County, IL","40420"]
["Boone County, IN","26900"]
["Boone County, KY","17140"]
["Boone County, MO","17860"]
["Boone County, NE","99928"]
["Boone County, WV","16620"]
["Borden County, TX","99945"]
["Bosque County, TX","99945"]
["Bossier Parish, LA","43340"]
["Botetourt County, VA","40220"]
["Bottineau County, ND","99935"]
["Boulder County, CO","14500"]
["Boundary County, ID","99913"]
["Bourbon County, KS","99917"]
["Bourbon County, KY","30460"]
["Bowie County, TX","45500"]
["Bowman County, ND","99935"]
["Box Butte County, NE","99928"]
["Box Elder County, UT","36260"]
["Boyd County, KY","26580"]
["Boyd County, NE","99928"]
["Boyle County, KY","99918"]
["Bracken County, KY","17140"]
["Bradford County, FL","99910"]
["Bradford County, PA","99939"]
["Bradley County, AR","99904"]
["Bradley County, TN","17420"]
["Branch County, MI","99923"]
["Brantley County, GA","15260"]
["Braxton County, WV","99951"]
["Brazoria County, TX","26420"]
["Brazos County, TX","17780"]
["Breathitt County, KY","99918"]
["Breckinridge County, KY","99918"]
["Bremer County, IA","47940"]
["Brevard County, FL","37340"]
["Brewster County, TX","99945"]
["Briscoe County, TX","99945"]
["Bristol Bay Borough, AK","99902"]
["Bristol City County, VA","28700"]
["Bristol County, MA","39300"]
["Bristol County, RI","39300"]
["Broadwater County, MT","99927"]
["Bronx County, NY","35614"]
["Brooke County, WV","48260"]
["Brookings County, SD","99943"]
["Brooks County, GA","46660"]
["Brooks County, TX","99945"]
["Broome County, NY","13780"]
["Broomfield County, CO","19740"]
["Broward County, FL","22744"]
["Brown County, IL","99914"]
["Brown County, IN","26900"]
["Brown County, KS","99917"]
["Brown County, MN","99924"]
["Brown County, NE","99928"]
["Brown County, OH","17140"]
["Brown County, SD","99943"]
["Brown County, TX","99945"]
["Brown County, WI","24580"]
["Brule County, SD","99943"]
["Brunswick County, NC","34820"]
["Brunswick County, VA","99949"]
["Bryan County, GA","42340"]
["Bryan County, OK","99937"]
["Buchanan County, IA","99916"]
["Buchanan County, MO","41140"]
["Buchanan County, VA","99949"]
["Buckingham County, VA","16820"]
["Bucks County, PA","33874"]
["Buena Vista City County, VA","99949"]
["Buena Vista County, IA","99916"]
["Buffalo County, NE","99928"]
["Buffalo County, SD","99943"]
["Buffalo County, WI","99952"]
["Bullitt County, KY","31140"]
["Bulloch County, GA","99911"]
["Bullock County, AL","99901"]
["Buncombe County, NC","11700"]
["Bureau County, IL","99914"]
["Burke County, GA","12260"]
["Burke County, NC","25860"]
["Burke County, ND","99935"]
["Burleigh County, ND","13900"]
["Burleson County, TX","17780"]
["Burlington County, NJ","15804"]
["Burnet County, TX","99945"]
["Burnett County, WI","99952"]
["Burt County, NE","99928"]
["Butler County, AL","99901"]
["Butler County, IA","99916"]
["Butler County, KS","48620"]
["Butler County, KY","14540"]
["Butler County, MO","99926"]
["Butler County, NE","99928"]
["Butler County, OH","17140"]
["Butler County, PA","38300"]
["Butte County, CA","17020"]
["Butte County, ID","26820"]
["Butte County, SD","99943"]
["Butts County, GA","12060"]
["Cabarrus County, NC","16740"]
["Cabell County, WV","26580"]
["Cabo Rojo Municipio, PR","41900"]
["Cache County, UT","30860"]
["Caddo County, OK","99937"]
["Caddo Parish, LA","43340"]
["Caguas Municipio, PR","41980"]
["Calaveras County, CA","99905"]
["Calcasieu Parish, LA","29340"]
["Caldwell County, KY","99918"]
["Caldwell County, MO","28140"]
["Caldwell County, NC","25860"]
["Caldwell County, TX","12420"]
["Caldwell Parish, LA","99919"]
["Caledonia County, VT","99947"]
["Calhoun County, AL","11500"]
["Calhoun County, AR","99904"]
["Calhoun County, FL","99910"]
["Calhoun County, GA","99911"]
["Calhoun County, IA","99916"]
["Calhoun County, IL","41180"]
["Calhoun County, MI","12980"]
["Calhoun County, MS","99925"]
["Calhoun County, SC","17900"]
["Calhoun County, TX","99945"]
["Calhoun County, WV","99951"]
["Callahan County, TX","10180"]
["Callaway County, MO","27620"]
["Calloway County, KY","99918"]
["Calumet County, WI","11540"]
["Calvert County, MD","47894"]
["Camas County, ID","99913"]
["Cambria County, PA","27780"]
["Camden County, GA","99911"]
["Camden County, MO","99926"]
["Camden County, NC","99934"]
["Camden County, NJ","15804"]
["Cameron County, PA","99939"]
["Cameron County, TX","15180"]
["Cameron Parish, LA","29340"]
["Camp County, TX","99945"]
["Campbell County, KY","17140"]
["Campbell County, SD","99943"]
["Campbell County, TN","28940"]
["Campbell County, VA","31340"]
["Campbell County, WY","99953"]
["Camuy Municipio, PR","11640"]
["Canadian County, OK","36420"]
["Candler County, GA","99911"]
["Cannon County, TN","34980"]
["Canovanas Municipio, PR","41980"]
["Canyon County, ID","14260"]
["Cape Girardeau County, MO","16020"]
["Cape May County, NJ","36140"]
["Carbon County, MT","13740"]
["Carbon County, PA","10900"]
["Carbon County, UT","99946"]
["Carbon County, WY","99953"]
["Caribou County, ID","99913"]
["Carlisle County, KY","99918"]
["Carlton County, MN","20260"]
["Carolina Municipio, PR","41980"]
["Caroline County, MD","99921"]
["Caroline County, VA","40060"]
["Carroll County, AR","99904"]
["Carroll County, GA","12060"]
["Carroll County, IA","99916"]
["Carroll County, IL","99914"]
["Carroll County, IN","29200"]
["Carroll County, KY","99918"]
["Carroll County, MD","12580"]
["Carroll County, MO","99926"]
["Carroll County, MS","99925"]
["Carroll County, NH","99930"]
["Carroll County, OH","15940"]
["Carroll County, TN","99944"]
["Carroll County, VA","99949"]
["Carson City County, NV","16180"]
["Carson County, TX","11100"]
["Carter County, KY","99918"]
["Carter County, MO","99926"]
["Carter County, MT","99927"]
["Carter County, OK","99937"]
["Carter County, TN","27740"]
["Carteret County, NC","99934"]
["Carver County, MN","33460"]
["Cascade County, MT","24500"]
["Casey County, KY","99918"]
["Cass County, IA","99916"]
["Cass County, IL","99914"]
["Cass County, IN","99915"]
["Cass County, MI","43780"]
["Cass County, MN","99924"]
["Cass County, MO","28140"]
["Cass County, ND","22020"]
["Cass County, NE","36540"]
["Cass County, TX","99945"]
["Cassia County, ID","99913"]
["Castro County, TX","99945"]
["Caswell County, NC","99934"]
["Catahoula Parish, LA","99919"]
["Catano Municipio, PR","41980"]
["Catawba County, NC","25860"]
["Catoosa County, GA","16860"]
["Catron County, NM","99932"]
["Cattaraugus County, NY","99933"]
["Cavalier County, ND","99935"]
["Cayey Municipio, PR","41980"]
["Cayuga County, NY","99933"]
["Cecil County, MD","48864"]
["Cedar County, IA","99916"]
["Cedar County, MO","99926"]
["Cedar County, NE","99928"]
["Ceiba Municipio, PR","41980"]
["Centre County, PA","44300"]
["Cerro Gordo County, IA","99916"]
["Chaffee County, CO","99906"]
["Chambers County, AL","99901"]
["Chambers County, TX","26420"]
["Champaign County, IL","16580"]
["Champaign County, OH","99936"]
["Chariton County, MO","99926"]
["Charles City County, VA","40060"]
["Charles County, MD","47894"]
["Charles Mix County, SD","99943"]
["Charleston County, SC","16700"]
["Charlevoix County, MI","99923"]
["Charlotte County, FL","39460"]
["Charlotte County, VA","99949"]
["Charlottesville City County, VA","16820"]
["Charlton County, GA","99911"]
["Chase County, KS","99917"]
["Chase County, NE","99928"]
["Chatham County, GA","42340"]
["Chatham County, NC","20500"]
["Chattahoochee County, GA","17980"]
["Chattooga County, GA","99911"]
["Chautauqua County, KS","99917"]
["Chautauqua County, NY","99933"]
["Chaves County, NM","99932"]
["Cheatham County, TN","34980"]
["Cheboygan County, MI","99923"]
["Chelan County, WA","48300"]
["Chemung County, NY","21300"]
["Chenango County, NY","99933"]
["Cherokee County, AL","99901"]
["Cherokee County, GA","12060"]
["Cherokee County, IA","99916"]
["Cherokee County, KS","99917"]
["Cherokee County, NC","99934"]
["Cherokee County, OK","99937"]
["Cherokee County, SC","99942"]
["Cherokee County, TX","99945"]
["Cherry County, NE","99928"]
["Chesapeake City County, VA","47260"]
["Cheshire County, NH","99930"]
["Chester County, PA","33874"]
["Chester County, SC","16740"]
["Chester County, TN","27180"]
["Chesterfield County, SC","99942"]
["Chesterfield County, VA","40060"]
["Cheyenne County, CO","99906"]
["Cheyenne County, KS","99917"]
["Cheyenne County, NE","99928"]
["Chickasaw County, IA","99916"]
["Chickasaw County, MS","99925"]
["Chicot County, AR","99904"]
["Childress County, TX","99945"]
["Chilton County, AL","13820"]
["Chippewa County, MI","99923"]
["Chippewa County, MN","99924"]
["Chippewa County, WI","20740"]
["Chisago County, MN","33460"]
["Chittenden County, VT","15540"]
["Choctaw County, AL","99901"]
["Choctaw County, MS","99925"]
["Choctaw County, OK","99937"]
["Chouteau County, MT","99927"]
["Chowan County, NC","99934"]
["Christian County, IL","99914"]
["Christian County, KY","17300"]
["Christian County, MO","44180"]
["Churchill County, NV","99929"]
["Ciales Municipio, PR","41980"]
["Cibola County, NM","99932"]
["Cidra Municipio, PR","41980"]
["Cimarron County, OK","99937"]
["Citrus County, FL","26140"]
["Clackamas County, OR","38900"]
["Claiborne County, MS","99925"]
["Claiborne County, TN","99944"]
["Claiborne Parish, LA","99919"]
["Clallam County, WA","99950"]
["Clare County, MI","99923"]
["Clarendon County, SC","99942"]
["Clarion County, PA","99939"]
["Clark County, AR","99904"]
["Clark County, ID","99913"]
["Clark County, IL","99914"]
["Clark County, IN","31140"]
["Clark County, KS","99917"]
["Clark County, KY","30460"]
["Clark County, MO","99926"]
["Clark County, NV","29820"]
["Clark County, OH","44220"]
["Clark County, SD","99943"]
["Clark County, WA","38900"]
["Clark County, WI","99952"]
["Clarke County, AL","99901"]
["Clarke County, GA","12020"]
["Clarke County, IA","99916"]
["Clarke County, MS","99925"]
["Clarke County, VA","47894"]
["Clatsop County, OR","99938"]
["Clay County, AL","99901"]
["Clay County, AR","99904"]
["Clay County, FL","27260"]
["Clay County, GA","99911"]
["Clay County, IA","99916"]
["Clay County, IL","99914"]
["Clay County, IN","45460"]
["Clay County, KS","99917"]
["Clay County, KY","99918"]
["Clay County, MN","22020"]
["Clay County, MO","28140"]
["Clay County, MS","99925"]
["Clay County, NC","99934"]
["Clay County, NE","99928"]
["Clay County, SD","99943"]
["Clay County, TN","99944"]
["Clay County, TX","48660"]
["Clay County, WV","16620"]
["Clayton County, GA","12060"]
["Clayton County, IA","99916"]
["Clear Creek County, CO","19740"]
["Clearfield County, PA","99939"]
["Clearwater County, ID","99913"]
["Clearwater County, MN","99924"]
["Cleburne County, AL","99901"]
["Cleburne County, AR","99904"]
["Clermont County, OH","17140"]
["Cleveland County, AR","38220"]
["Cleveland County, NC","99934"]
["Cleveland County, OK","36420"]
["Clinch County, GA","99911"]
["Clinton County, IA","99916"]
["Clinton County, IL","41180"]
["Clinton County, IN","99915"]
["Clinton County, KY","99918"]
["Clinton County, MI","29620"]
["Clinton County, MO","28140"]
["Clinton County, NY","99933"]
["Clinton County, OH","99936"]
["Clinton County, PA","99939"]
["Cloud County, KS","99917"]
["Coahoma County, MS","99925"]
["Coal County, OK","99937"]
["Coamo Municipio, PR","99940"]
["Cobb County, GA","12060"]
["Cochise County, AZ","43420"]
["Cochran County, TX","99945"]
["Cocke County, TN","99944"]
["Coconino County, AZ","22380"]
["Codington County, SD","99943"]
["Coffee County, AL","99901"]
["Coffee County, GA","99911"]
["Coffee County, TN","99944"]
["Coffey County, KS","99917"]
["Coke County, TX","99945"]
["Colbert County, AL","22520"]
["Cole County, MO","27620"]
["Coleman County, TX","99945"]
["Coles County, IL","99914"]
["Colfax County, NE","99928"]
["Colfax County, NM","99932"]
["Colleton County, SC","99942"]
["Collier County, FL","34940"]
["Collin County, TX","19124"]
["Collingsworth County, TX","99945"]
["Colonial Heights City County, VA","40060"]
["Colorado County, TX","99945"]
["Colquitt County, GA","99911"]
["Columbia County, AR","99904"]
["Columbia County, FL","99910"]
["Columbia County, GA","12260"]
["Columbia County, NY","99933"]
["Columbia County, OR","38900"]
["Columbia County, PA","14100"]
["Columbia County, WA","47460"]
["Columbia County, WI","31540"]
["Columbiana County, OH","99936"]
["Columbus County, NC","99934"]
["Colusa County, CA","99905"]
["Comal County, TX","41700"]
["Comanche County, KS","99917"]
["Comanche County, OK","30020"]
["Comanche County, TX","99945"]
["Comerio Municipio, PR","41980"]
["Concho County, TX","99945"]
["Concordia Parish, LA","99919"]
["Conecuh County, AL","99901"]
["Conejos County, CO","99906"]
["Contra Costa County, CA","36084"]
["Converse County, WY","99953"]
["Conway County, AR","99904"]
["Cook County, GA","99911"]
["Cook County, IL","16974"]
["Cook County, MN","99924"]
["Cooke County, TX","99945"]
["Cooper County, MO","99926"]
["Coos County, NH","99930"]
["Coos County, OR","99938"]
["Coosa County, AL","99901"]
["Copiah County, MS","27140"]
["Corozal Municipio, PR","41980"]
["Corson County, SD","99943"]
["Cortland County, NY","99933"]
["Coryell County, TX","28660"]
["Coshocton County, OH","99936"]
["Costilla County, CO","99906"]
["Cottle County, TX","99945"]
["Cotton County, OK","30020"]
["Cottonwood County, MN","99924"]
["Covington City County, VA","99949"]
["Covington County, AL","99901"]
["Covington County, MS","99925"]
["Coweta County, GA","12060"]
["Cowley County, KS","99917"]
["Cowlitz County, WA","31020"]
["Craig County, OK","99937"]
["Craig County, VA","40220"]
["Craighead County, AR","27860"]
["Crane County, TX","99945"]
["Craven County, NC","35100"]
["Crawford County, AR","22900"]
["Crawford County, GA","31420"]
["Crawford County, IA","99916"]
["Crawford County, IL","99914"]
["Crawford County, IN","99915"]
["Crawford County, KS","99917"]
["Crawford County, MI","99923"]
["Crawford County, MO","99926"]
["Crawford County, OH","99936"]
["Crawford County, PA","99939"]
["Crawford County, WI","99952"]
["Creek County, OK","46140"]
["Crenshaw County, AL","99901"]
["Crisp County, GA","99911"]
["Crittenden County, AR","32820"]
["Crittenden County, KY","99918"]
["Crockett County, TN","27180"]
["Crockett County, TX","99945"]
["Crook County, OR","99938"]
["Crook County, WY","99953"]
["Crosby County, TX","31180"]
["Cross County, AR","99904"]
["Crow Wing County, MN","99924"]
["Crowley County, CO","99906"]
["Culberson County, TX","99945"]
["Culebra Municipio, PR","99940"]
["Cullman County, AL","99901"]
["Culpeper County, VA","47894"]
["Cumberland County, IL","99914"]
["Cumberland County, KY","99918"]
["Cumberland County, ME","38860"]
["Cumberland County, NC","22180"]
["Cumberland County, NJ","47220"]
["Cumberland County, PA","25420"]
["Cumberland County, TN","99944"]
["Cumberland County, VA","99949"]
["Cuming County, NE","99928"]
["Currituck County, NC","47260"]
["Curry County, NM","99932"]
["Curry County, OR","99938"]
["Custer County, CO","99906"]
["Custer County, ID","99913"]
["Custer County, MT","99927"]
["Custer County, NE","99928"]
["Custer County, OK","99937"]
["Custer County, SD","39660"]
["Cuyahoga County, OH","17460"]
["Dade County, GA","16860"]
["Dade County, MO","99926"]
["Daggett County, UT","99946"]
["Dakota County, MN","33460"]
["Dakota County, NE","43580"]
["Dale County, AL","99901"]
["Dallam County, TX","99945"]
["Dallas County, AL","99901"]
["Dallas County, AR","99904"]
["Dallas County, IA","19780"]
["Dallas County, MO","44180"]
["Dallas County, TX","19124"]
["Dane County, WI","31540"]
["Daniels County, MT","99927"]
["Danville City County, VA","99949"]
["Dare County, NC","99934"]
["Darke County, OH","99936"]
["Darlington County, SC","22500"]
["Dauphin County, PA","25420"]
["Davidson County, NC","49180"]
["Davidson County, TN","34980"]
["Davie County, NC","49180"]
["Daviess County, IN","99915"]
["Daviess County, KY","36980"]
["Daviess County, MO","99926"]
["Davis County, IA","99916"]
["Davis County, UT","36260"]
["Davison County, SD","99943"]
["Dawes County, NE","99928"]
["Dawson County, GA","12060"]
["Dawson County, MT","99927"]
["Dawson County, NE","99928"]
["Dawson County, TX","99945"]
["Day County, SD","99943"]
["De Baca County, NM","99932"]
["Deaf Smith County, TX","99945"]
["Dearborn County, IN","17140"]
["Decatur County, GA","99911"]
["Decatur County, IA","99916"]
["Decatur County, IN","99915"]
["Decatur County, KS","99917"]
["Decatur County, TN","99944"]
["Deer Lodge County, MT","99927"]
["Defiance County, OH","99936"]
["DeKalb County, AL","99901"]
["DeKalb County, GA","12060"]
["DeKalb County, IL","20994"]
["DeKalb County, IN","99915"]
["DeKalb County, MO","41140"]
["DeKalb County, TN","99944"]
["Del Norte County, CA","99905"]
["Delaware County, IA","99916"]
["Delaware County, IN","34620"]
["Delaware County, NY","99933"]
["Delaware County, OH","18140"]
["Delaware County, OK","99937"]
["Delaware County, PA","37964"]
["Delta County, CO","99906"]
["Delta County, MI","99923"]
["Delta County, TX","99945"]
["Denali Borough, AK","99902"]
["Dent County, MO","99926"]
["Denton County, TX","19124"]
["Denver County, CO","19740"]
["Des Moines County, IA","99916"]
["Deschutes County, OR","13460"]
["Desha County, AR","99904"]
["DeSoto County, FL","99910"]
["DeSoto County, MS","32820"]
["DeSoto Parish, LA","43340"]
["Deuel County, NE","99928"]
["Deuel County, SD","99943"]
["Dewey County, OK","99937"]
["Dewey County, SD","99943"]
["DeWitt County, IL","14010"]
["DeWitt County, TX","99945"]
["Dickens County, TX","99945"]
["Dickenson County, VA","99949"]
["Dickey County, ND","99935"]
["Dickinson County, IA","99916"]
["Dickinson County, KS","99917"]
["Dickinson County, MI","99923"]
["Dickson County, TN","34980"]
["Dillingham Borough, AK","99902"]
["Dillon County, SC","99942"]
["Dimmit County, TX","99945"]
["Dinwiddie County, VA","40060"]
["Divide County, ND","99935"]
["Dixie County, FL","99910"]
["Dixon County, NE","43580"]
["Doddridge County, WV","99951"]
["Dodge County, GA","99911"]
["Dodge County, MN","40340"]
["Dodge County, NE","99928"]
["Dodge County, WI","99952"]
["Dolores County, CO","99906"]
["Dona Ana County, NM","29740"]
["Doniphan County, KS","41140"]
["Donley County, TX","99945"]
["Dooly County, GA","99911"]
["Door County, WI","99952"]
["Dorado Municipio, PR","41980"]
["Dorchester County, MD","99921"]
["Dorchester County, SC","16700"]
["Dougherty County, GA","10500"]
["Douglas County, CO","19740"]
["Douglas County, GA","12060"]
["Douglas County, IL","99914"]
["Douglas County, KS","29940"]
["Douglas County, MN","99924"]
["Douglas County, MO","99926"]
["Douglas County, NE","36540"]
["Douglas County, NV","99929"]
["Douglas County, OR","99938"]
["Douglas County, SD","99943"]
["Douglas County, WA","48300"]
["Douglas County, WI","20260"]
["Drew County, AR","99904"]
["Dubois County, IN","99915"]
["Dubuque County, IA","20220"]
["Duchesne County, UT","99946"]
["Dukes County, MA","99922"]
["Dundy County, NE","99928"]
["Dunklin County, MO","99926"]
["Dunn County, ND","99935"]
["Dunn County, WI","99952"]
["DuPage County, IL","16974"]
["Dupage County, IL",16974]
["Duplin County, NC","99934"]
["Durham County, NC","20500"]
["Dutchess County, NY","20524"]
["Duval County, FL","27260"]
["Duval County, TX","99945"]
["Dyer County, TN","99944"]
["Eagle County, CO","99906"]
["Early County, GA","99911"]
["East Baton Rouge Parish, LA","12940"]
["East Carroll Parish, LA","99919"]
["East Feliciana Parish, LA","12940"]
["Eastland County, TX","99945"]
["Eaton County, MI","29620"]
["Eau Claire County, WI","20740"]
["Echols County, GA","46660"]
["Ector County, TX","36220"]
["Eddy County, ND","99935"]
["Eddy County, NM","99932"]
["Edgar County, IL","99914"]
["Edgecombe County, NC","40580"]
["Edgefield County, SC","12260"]
["Edmonson County, KY","14540"]
["Edmunds County, SD","99943"]
["Edwards County, IL","99914"]
["Edwards County, KS","99917"]
["Edwards County, TX","99945"]
["Effingham County, GA","42340"]
["Effingham County, IL","99914"]
["El Dorado County, CA","40900"]
["El Paso County, CO","17820"]
["El Paso County, TX","21340"]
["Elbert County, CO","19740"]
["Elbert County, GA","99911"]
["Elk County, KS","99917"]
["Elk County, PA","99939"]
["Elkhart County, IN","21140"]
["Elko County, NV","99929"]
["Elliott County, KY","99918"]
["Ellis County, KS","99917"]
["Ellis County, OK","99937"]
["Ellis County, TX","19124"]
["Ellsworth County, KS","99917"]
["Elmore County, AL","33860"]
["Elmore County, ID","99913"]
["Emanuel County, GA","99911"]
["Emery County, UT","99946"]
["Emmet County, IA","99916"]
["Emmet County, MI","99923"]
["Emmons County, ND","99935"]
["Emporia City County, VA","99949"]
["Erath County, TX","99945"]
["Erie County, NY","15380"]
["Erie County, OH","99936"]
["Erie County, PA","21500"]
["Escambia County, AL","99901"]
["Escambia County, FL","37860"]
["Esmeralda County, NV","99929"]
["Essex County, MA","15764"]
["Essex County, NJ","35084"]
["Essex County, NY","99933"]
["Essex County, VA","99949"]
["Essex County, VT","99947"]
["Estill County, KY","99918"]
["Etowah County, AL","23460"]
["Eureka County, NV","99929"]
["Evangeline Parish, LA","99919"]
["Evans County, GA","99911"]
["Fairbanks North Star Borough, AK","21820"]
["Fairfax City County, VA","47894"]
["Fairfax County, VA","47894"]
["Fairfield County, CT","14860"]
["Fairfield County, OH","18140"]
["Fairfield County, SC","17900"]
["Fajardo Municipio, PR","41980"]
["Fall River County, SD","99943"]
["Fallon County, MT","99927"]
["Falls Church City County, VA","47894"]
["Falls County, TX","47380"]
["Fannin County, GA","99911"]
["Fannin County, TX","99945"]
["Faribault County, MN","99924"]
["Faulk County, SD","99943"]
["Faulkner County, AR","30780"]
["Fauquier County, VA","47894"]
["Fayette County, AL","99901"]
["Fayette County, GA","12060"]
["Fayette County, IA","99916"]
["Fayette County, IL","99914"]
["Fayette County, IN","99915"]
["Fayette County, KY","30460"]
["Fayette County, OH","99936"]
["Fayette County, PA","38300"]
["Fayette County, TN","32820"]
["Fayette County, TX","99945"]
["Fayette County, WV","13220"]
["Fentress County, TN","99944"]
["Fergus County, MT","99927"]
["Ferry County, WA","99950"]
["Fillmore County, MN","40340"]
["Fillmore County, NE","99928"]
["Finney County, KS","99917"]
["Fisher County, TX","99945"]
["Flagler County, FL","19660"]
["Flathead County, MT","99927"]
["Fleming County, KY","99918"]
["Florence County, SC","22500"]
["Florence County, WI","99952"]
["Florida Municipio, PR","41980"]
["Floyd County, GA","40660"]
["Floyd County, IA","99916"]
["Floyd County, IN","31140"]
["Floyd County, KY","99918"]
["Floyd County, TX","99945"]
["Floyd County, VA","13980"]
["Fluvanna County, VA","16820"]
["Foard County, TX","99945"]
["Fond Du Lac County, WI","22540"]
["Ford County, IL","16580"]
["Ford County, KS","99917"]
["Forest County, PA","99939"]
["Forest County, WI","99952"]
["Forrest County, MS","25620"]
["Forsyth County, GA","12060"]
["Forsyth County, NC","49180"]
["Fort Bend County, TX","26420"]
["Foster County, ND","99935"]
["Fountain County, IN","99915"]
["Franklin City County, VA","99949"]
["Franklin County, AL","99901"]
["Franklin County, AR","99904"]
["Franklin County, FL","99910"]
["Franklin County, GA","99911"]
["Franklin County, IA","99916"]
["Franklin County, ID","30860"]
["Franklin County, IL","99914"]
["Franklin County, IN","99915"]
["Franklin County, KS","99917"]
["Franklin County, KY","99918"]
["Franklin County, MA","99922"]
["Franklin County, ME","99920"]
["Franklin County, MO","41180"]
["Franklin County, MS","99925"]
["Franklin County, NC","39580"]
["Franklin County, NE","99928"]
["Franklin County, NY","99933"]
["Franklin County, OH","18140"]
["Franklin County, PA","16540"]
["Franklin County, TN","99944"]
["Franklin County, TX","99945"]
["Franklin County, VA","40220"]
["Franklin County, VT","15540"]
["Franklin County, WA","28420"]
["Franklin Parish, LA","99919"]
["Frederick County, MD","43524"]
["Frederick County, VA","49020"]
["Fredericksburg City County, VA","47894"]
["Freeborn County, MN","99924"]
["Freestone County, TX","99945"]
["Fremont County, CO","99906"]
["Fremont County, IA","99916"]
["Fremont County, ID","99913"]
["Fremont County, WY","99953"]
["Fresno County, CA","23420"]
["Frio County, TX","99945"]
["Frontier County, NE","99928"]
["Fulton County, AR","99904"]
["Fulton County, GA","12060"]
["Fulton County, IL","99914"]
["Fulton County, IN","99915"]
["Fulton County, KY","99918"]
["Fulton County, NY","99933"]
["Fulton County, OH","45780"]
["Fulton County, PA","99939"]
["Furnas County, NE","99928"]
["Gadsden County, FL","45220"]
["Gage County, NE","99928"]
["Gaines County, TX","99945"]
["Galax City County, VA","99949"]
["Gallatin County, IL","99914"]
["Gallatin County, KY","17140"]
["Gallatin County, MT","99927"]
["Gallia County, OH","99936"]
["Galveston County, TX","26420"]
["Garden County, NE","99928"]
["Garfield County, CO","99906"]
["Garfield County, MT","99927"]
["Garfield County, NE","99928"]
["Garfield County, OK","99937"]
["Garfield County, UT","99946"]
["Garfield County, WA","99950"]
["Garland County, AR","26300"]
["Garrard County, KY","99918"]
["Garrett County, MD","99921"]
["Garvin County, OK","99937"]
["Garza County, TX","99945"]
["Gasconade County, MO","99926"]
["Gaston County, NC","16740"]
["Gates County, NC","47260"]
["Geary County, KS","99917"]
["Geauga County, OH","17460"]
["Gem County, ID","14260"]
["Genesee County, MI","22420"]
["Genesee County, NY","99933"]
["Geneva County, AL","20020"]
["Gentry County, MO","99926"]
["George County, MS","99925"]
["Georgetown County, SC","99942"]
["Gibson County, IN","99915"]
["Gibson County, TN","99944"]
["Gila County, AZ","99903"]
["Gilchrist County, FL","23540"]
["Giles County, TN","99944"]
["Giles County, VA","13980"]
["Gillespie County, TX","99945"]
["Gilliam County, OR","99938"]
["Gilmer County, GA","99911"]
["Gilmer County, WV","99951"]
["Gilpin County, CO","19740"]
["Glacier County, MT","99927"]
["Glades County, FL","99910"]
["Gladwin County, MI","99923"]
["Glascock County, GA","99911"]
["Glasscock County, TX","99945"]
["Glenn County, CA","99905"]
["Gloucester County, NJ","15804"]
["Gloucester County, VA","47260"]
["Glynn County, GA","15260"]
["Gogebic County, MI","99923"]
["Golden Valley County, MT","13740"]
["Golden Valley County, ND","99935"]
["Goliad County, TX","47020"]
["Gonzales County, TX","99945"]
["Goochland County, VA","40060"]
["Goodhue County, MN","99924"]
["Gooding County, ID","99913"]
["Gordon County, GA","99911"]
["Goshen County, WY","99953"]
["Gosper County, NE","99928"]
["Gove County, KS","99917"]
["Grady County, GA","99911"]
["Grady County, OK","36420"]
["Grafton County, NH","99930"]
["Graham County, AZ","99903"]
["Graham County, KS","99917"]
["Graham County, NC","99934"]
["Grainger County, TN","28940"]
["Grand County, CO","99906"]
["Grand County, UT","99946"]
["Grand Forks County, ND","24220"]
["Grand Isle County, VT","15540"]
["Grand Traverse County, MI","99923"]
["Granite County, MT","99927"]
["Grant County, AR","30780"]
["Grant County, IN","99915"]
["Grant County, KS","99917"]
["Grant County, KY","17140"]
["Grant County, MN","99924"]
["Grant County, ND","99935"]
["Grant County, NE","99928"]
["Grant County, NM","99932"]
["Grant County, OK","99937"]
["Grant County, OR","99938"]
["Grant County, SD","99943"]
["Grant County, WA","99950"]
["Grant County, WI","99952"]
["Grant County, WV","99951"]
["Grant Parish, LA","10780"]
["Granville County, NC","99934"]
["Gratiot County, MI","99923"]
["Graves County, KY","99918"]
["Gray County, KS","99917"]
["Gray County, TX","99945"]
["Grays Harbor County, WA","99950"]
["Grayson County, KY","99918"]
["Grayson County, TX","43300"]
["Grayson County, VA","99949"]
["Greeley County, KS","99917"]
["Greeley County, NE","99928"]
["Green County, KY","99918"]
["Green County, WI","31540"]
["Green Lake County, WI","99952"]
["Greenbrier County, WV","99951"]
["Greene County, AL","99901"]
["Greene County, AR","99904"]
["Greene County, GA","99911"]
["Greene County, IA","99916"]
["Greene County, IL","99914"]
["Greene County, IN","99915"]
["Greene County, MO","44180"]
["Greene County, MS","99925"]
["Greene County, NC","99934"]
["Greene County, NY","99933"]
["Greene County, OH","19380"]
["Greene County, PA","99939"]
["Greene County, TN","99944"]
["Greene County, VA","16820"]
["Greenlee County, AZ","99903"]
["Greensville County, VA","99949"]
["Greenup County, KY","26580"]
["Greenville County, SC","24860"]
["Greenwood County, KS","99917"]
["Greenwood County, SC","99942"]
["Greer County, OK","99937"]
["Gregg County, TX","30980"]
["Gregory County, SD","99943"]
["Grenada County, MS","99925"]
["Griggs County, ND","99935"]
["Grimes County, TX","99945"]
["Grundy County, IA","47940"]
["Grundy County, IL","16974"]
["Grundy County, MO","99926"]
["Grundy County, TN","99944"]
["Guadalupe County, NM","99932"]
["Guadalupe County, TX","41700"]
["Guanica Municipio, PR","38660"]
["Guayama Municipio, PR","25020"]
["Guayanilla Municipio, PR","38660"]
["Guaynabo Municipio, PR","41980"]
["Guernsey County, OH","99936"]
["Guilford County, NC","24660"]
["Gulf County, FL","37460"]
["Gunnison County, CO","99906"]
["Gurabo Municipio, PR","41980"]
["Guthrie County, IA","19780"]
["Gwinnett County, GA","12060"]
["Haakon County, SD","99943"]
["Habersham County, GA","99911"]
["Haines Borough, AK","99902"]
["Hale County, AL","46220"]
["Hale County, TX","99945"]
["Halifax County, NC","99934"]
["Halifax County, VA","99949"]
["Hall County, GA","23580"]
["Hall County, NE","24260"]
["Hall County, TX","99945"]
["Hamblen County, TN","34100"]
["Hamilton County, FL","99910"]
["Hamilton County, IA","99916"]
["Hamilton County, IL","99914"]
["Hamilton County, IN","26900"]
["Hamilton County, KS","99917"]
["Hamilton County, NE","24260"]
["Hamilton County, NY","99933"]
["Hamilton County, OH","17140"]
["Hamilton County, TN","16860"]
["Hamilton County, TX","99945"]
["Hamlin County, SD","99943"]
["Hampden County, MA","44140"]
["Hampshire County, MA","44140"]
["Hampshire County, WV","49020"]
["Hampton City County, VA","47260"]
["Hampton County, SC","99942"]
["Hancock County, GA","99911"]
["Hancock County, IA","99916"]
["Hancock County, IL","99914"]
["Hancock County, IN","26900"]
["Hancock County, KY","36980"]
["Hancock County, ME","99920"]
["Hancock County, MS","25060"]
["Hancock County, OH","99936"]
["Hancock County, TN","99944"]
["Hancock County, WV","48260"]
["Hand County, SD","99943"]
["Hanover County, VA","40060"]
["Hansford County, TX","99945"]
["Hanson County, SD","99943"]
["Haralson County, GA","12060"]
["Hardee County, FL","99910"]
["Hardeman County, TN","99944"]
["Hardeman County, TX","99945"]
["Hardin County, IA","99916"]
["Hardin County, IL","99914"]
["Hardin County, KY","21060"]
["Hardin County, OH","99936"]
["Hardin County, TN","99944"]
["Hardin County, TX","13140"]
["Harding County, NM","99932"]
["Harding County, SD","99943"]
["Hardy County, WV","99951"]
["Harford County, MD","12580"]
["Harlan County, KY","99918"]
["Harlan County, NE","99928"]
["Harmon County, OK","99937"]
["Harnett County, NC","99934"]
["Harney County, OR","99938"]
["Harper County, KS","99917"]
["Harper County, OK","99937"]
["Harris County, GA","17980"]
["Harris County, TX","26420"]
["Harrison County, IA","36540"]
["Harrison County, IN","31140"]
["Harrison County, KY","99918"]
["Harrison County, MO","99926"]
["Harrison County, MS","25060"]
["Harrison County, OH","99936"]
["Harrison County, TX","99945"]
["Harrison County, WV","99951"]
["Harrisonburg City County, VA","25500"]
["Hart County, GA","99911"]
["Hart County, KY","99918"]
["Hartford County, CT","25540"]
["Hartley County, TX","99945"]
["Harvey County, KS","48620"]
["Haskell County, KS","99917"]
["Haskell County, OK","99937"]
["Haskell County, TX","99945"]
["Hatillo Municipio, PR","11640"]
["Hawaii County, HI","99912"]
["Hawkins County, TN","28700"]
["Hayes County, NE","99928"]
["Hays County, TX","12420"]
["Haywood County, NC","11700"]
["Haywood County, TN","99944"]
["Heard County, GA","12060"]
["Hemphill County, TX","99945"]
["Hempstead County, AR","99904"]
["Henderson County, IL","99914"]
["Henderson County, KY","21780"]
["Henderson County, NC","11700"]
["Henderson County, TN","99944"]
["Henderson County, TX","99945"]
["Hendricks County, IN","26900"]
["Hendry County, FL","99910"]
["Hennepin County, MN","33460"]
["Henrico County, VA","40060"]
["Henry County, AL","20020"]
["Henry County, GA","12060"]
["Henry County, IA","99916"]
["Henry County, IL","19340"]
["Henry County, IN","99915"]
["Henry County, KY","31140"]
["Henry County, MO","99926"]
["Henry County, OH","99936"]
["Henry County, TN","99944"]
["Henry County, VA","99949"]
["Herkimer County, NY","46540"]
["Hernando County, FL","45300"]
["Hertford County, NC","99934"]
["Hettinger County, ND","99935"]
["Hickman County, KY","99918"]
["Hickman County, TN","34980"]
["Hickory County, MO","99926"]
["Hidalgo County, NM","99932"]
["Hidalgo County, TX","32580"]
["Highland County, OH","99936"]
["Highland County, VA","99949"]
["Highlands County, FL","42700"]
["Hill County, MT","99927"]
["Hill County, TX","99945"]
["Hillsborough County, FL","45300"]
["Hillsborough County, NH","31700"]
["Hillsdale County, MI","99923"]
["Hinds County, MS","27140"]
["Hinsdale County, CO","99906"]
["Hitchcock County, NE","99928"]
["Hocking County, OH","18140"]
["Hockley County, TX","99945"]
["Hodgeman County, KS","99917"]
["Hoke County, NC","22180"]
["Holmes County, FL","99910"]
["Holmes County, MS","99925"]
["Holmes County, OH","99936"]
["Holt County, MO","99926"]
["Holt County, NE","99928"]
["Honolulu County, HI","46520"]
["Hood County, TX","23104"]
["Hood River County, OR","99938"]
["Hooker County, NE","99928"]
["Hoonah-Angoon Census Area, AK","99902"]
["Hopewell City County, VA","40060"]
["Hopkins County, KY","99918"]
["Hopkins County, TX","99945"]
["Hormigueros Municipio, PR","32420"]
["Horry County, SC","34820"]
["Hot Spring County, AR","99904"]
["Hot Springs County, WY","99953"]
["Houghton County, MI","99923"]
["Houston County, AL","20020"]
["Houston County, GA","47580"]
["Houston County, MN","29100"]
["Houston County, TN","99944"]
["Houston County, TX","99945"]
["Howard County, AR","99904"]
["Howard County, IA","99916"]
["Howard County, IN","29020"]
["Howard County, MD","12580"]
["Howard County, MO","99926"]
["Howard County, NE","24260"]
["Howard County, TX","99945"]
["Howell County, MO","99926"]
["Hubbard County, MN","99924"]
["Hudson County, NJ","35614"]
["Hudspeth County, TX","21340"]
["Huerfano County, CO","99906"]
["Hughes County, OK","99937"]
["Hughes County, SD","99943"]
["Humacao Municipio, PR","41980"]
["Humboldt County, CA","99905"]
["Humboldt County, IA","99916"]
["Humboldt County, NV","99929"]
["Humphreys County, MS","99925"]
["Humphreys County, TN","99944"]
["Hunt County, TX","19124"]
["Hunterdon County, NJ","35084"]
["Huntingdon County, PA","99939"]
["Huntington County, IN","99915"]
["Huron County, MI","99923"]
["Huron County, OH","99936"]
["Hutchinson County, SD","99943"]
["Hutchinson County, TX","99945"]
["Hyde County, NC","99934"]
["Hyde County, SD","99943"]
["Iberia Parish, LA","29180"]
["Iberville Parish, LA","12940"]
["Ida County, IA","99916"]
["Idaho County, ID","99913"]
["Imperial County, CA","20940"]
["Independence County, AR","99904"]
["Indian River County, FL","42680"]
["Indiana County, PA","99939"]
["Ingham County, MI","29620"]
["Inyo County, CA","99905"]
["Ionia County, MI","99923"]
["Iosco County, MI","99923"]
["Iowa County, IA","99916"]
["Iowa County, WI","31540"]
["Iredell County, NC","16740"]
["Irion County, TX","41660"]
["Iron County, MI","99923"]
["Iron County, MO","99926"]
["Iron County, UT","99946"]
["Iron County, WI","99952"]
["Iroquois County, IL","99914"]
["Irwin County, GA","99911"]
["Isabela Municipio, PR","10380"]
["Isabella County, MI","99923"]
["Isanti County, MN","33460"]
["Island County, WA","99950"]
["Isle Of Wight County, VA","47260"]
["Issaquena County, MS","99925"]
["Itasca County, MN","99924"]
["Itawamba County, MS","99925"]
["Izard County, AR","99904"]
["Jack County, TX","99945"]
["Jackson County, AL","99901"]
["Jackson County, AR","99904"]
["Jackson County, CO","99906"]
["Jackson County, FL","99910"]
["Jackson County, GA","99911"]
["Jackson County, IA","99916"]
["Jackson County, IL","16060"]
["Jackson County, IN","99915"]
["Jackson County, KS","45820"]
["Jackson County, KY","99918"]
["Jackson County, MI","27100"]
["Jackson County, MN","99924"]
["Jackson County, MO","28140"]
["Jackson County, MS","25060"]
["Jackson County, NC","99934"]
["Jackson County, OH","99936"]
["Jackson County, OK","99937"]
["Jackson County, OR","32780"]
["Jackson County, SD","99943"]
["Jackson County, TN","99944"]
["Jackson County, TX","99945"]
["Jackson County, WI","99952"]
["Jackson County, WV","99951"]
["Jackson Parish, LA","99919"]
["James City County, VA","47260"]
["Jasper County, GA","12060"]
["Jasper County, IA","99916"]
["Jasper County, IL","99914"]
["Jasper County, IN","23844"]
["Jasper County, MO","27900"]
["Jasper County, MS","99925"]
["Jasper County, SC","25940"]
["Jasper County, TX","99945"]
["Jay County, IN","99915"]
["Jayuya Municipio, PR","99940"]
["Jeff Davis County, GA","99911"]
["Jeff Davis County, TX","99945"]
["Jefferson County, AL","13820"]
["Jefferson County, AR","38220"]
["Jefferson County, CO","19740"]
["Jefferson County, FL","45220"]
["Jefferson County, GA","99911"]
["Jefferson County, IA","99916"]
["Jefferson County, ID","26820"]
["Jefferson County, IL","99914"]
["Jefferson County, IN","99915"]
["Jefferson County, KS","45820"]
["Jefferson County, KY","31140"]
["Jefferson County, MO","41180"]
["Jefferson County, MS","99925"]
["Jefferson County, MT","99927"]
["Jefferson County, NE","99928"]
["Jefferson County, NY","48060"]
["Jefferson County, OH","48260"]
["Jefferson County, OK","99937"]
["Jefferson County, OR","99938"]
["Jefferson County, PA","99939"]
["Jefferson County, TN","34100"]
["Jefferson County, TX","13140"]
["Jefferson County, WA","99950"]
["Jefferson County, WI","99952"]
["Jefferson County, WV","47894"]
["Jefferson Davis County, MS","99925"]
["Jefferson Parish, LA","35380"]
["Jeffrson Davis Parish, LA","99919"]
["Jenkins County, GA","99911"]
["Jennings County, IN","99915"]
["Jerauld County, SD","99943"]
["Jerome County, ID","99913"]
["Jersey County, IL","41180"]
["Jessamine County, KY","30460"]
["Jewell County, KS","99917"]
["Jim Hogg County, TX","99945"]
["Jim Wells County, TX","99945"]
["Jo Daviess County, IL","99914"]
["Johnson County, AR","99904"]
["Johnson County, GA","99911"]
["Johnson County, IA","26980"]
["Johnson County, IL","99914"]
["Johnson County, IN","26900"]
["Johnson County, KS","28140"]
["Johnson County, KY","99918"]
["Johnson County, MO","99926"]
["Johnson County, NE","99928"]
["Johnson County, TN","99944"]
["Johnson County, TX","23104"]
["Johnson County, WY","99953"]
["Johnston County, NC","39580"]
["Johnston County, OK","99937"]
["Jones County, GA","31420"]
["Jones County, IA","16300"]
["Jones County, MS","99925"]
["Jones County, NC","35100"]
["Jones County, SD","99943"]
["Jones County, TX","10180"]
["Josephine County, OR","24420"]
["Juab County, UT","39340"]
["Juana Diaz Municipio, PR","38660"]
["Judith Basin County, MT","99927"]
["Juncos Municipio, PR","41980"]
["Juneau Borough, AK","99902"]
["Juneau County, WI","99952"]
["Juniata County, PA","99939"]
["Kalamazoo County, MI","28020"]
["Kalawao County, HI","27980"]
["Kalkaska County, MI","99923"]
["Kanabec County, MN","99924"]
["Kanawha County, WV","16620"]
["Kandiyohi County, MN","99924"]
["Kane County, IL","20994"]
["Kane County, UT","99946"]
["Kankakee County, IL","28100"]
["Karnes County, TX","99945"]
["Kauai County, HI","99912"]
["Kaufman County, TX","19124"]
["Kay County, OK","99937"]
["Kearney County, NE","99928"]
["Kearny County, KS","99917"]
["Keith County, NE","99928"]
["Kemper County, MS","99925"]
["Kenai Peninsula Borough, AK","99902"]
["Kendall County, IL","16974"]
["Kendall County, TX","41700"]
["Kenedy County, TX","99945"]
["Kennebec County, ME","99920"]
["Kenosha County, WI","29404"]
["Kent County, DE","20100"]
["Kent County, MD","99921"]
["Kent County, MI","24340"]
["Kent County, RI","39300"]
["Kent County, TX","99945"]
["Kenton County, KY","17140"]
["Keokuk County, IA","99916"]
["Kern County, CA","12540"]
["Kerr County, TX","99945"]
["Kershaw County, SC","17900"]
["Ketchikan Gateway Borough, AK","99902"]
["Kewaunee County, WI","24580"]
["Keweenaw County, MI","99923"]
["Keya Paha County, NE","99928"]
["Kidder County, ND","99935"]
["Kimball County, NE","99928"]
["Kimble County, TX","99945"]
["King And Queen County, VA","99949"]
["King County, TX","99945"]
["King County, WA","42644"]
["King George County, VA","99949"]
["King William County, VA","40060"]
["Kingfisher County, OK","99937"]
["Kingman County, KS","48620"]
["Kings County, CA","25260"]
["Kings County, NY","35614"]
["Kingsbury County, SD","99943"]
["Kinney County, TX","99945"]
["Kiowa County, CO","99906"]
["Kiowa County, KS","99917"]
["Kiowa County, OK","99937"]
["Kit Carson County, CO","99906"]
["Kitsap County, WA","14740"]
["Kittitas County, WA","99950"]
["Kittson County, MN","99924"]
["Klamath County, OR","99938"]
["Kleberg County, TX","99945"]
["Klickitat County, WA","99950"]
["Knott County, KY","99918"]
["Knox County, IL","99914"]
["Knox County, IN","99915"]
["Knox County, KY","99918"]
["Knox County, ME","99920"]
["Knox County, MO","99926"]
["Knox County, NE","99928"]
["Knox County, OH","99936"]
["Knox County, TN","28940"]
["Knox County, TX","99945"]
["Kodiak Island Borough, AK","99902"]
["Koochiching County, MN","99924"]
["Kootenai County, ID","17660"]
["Kosciusko County, IN","99915"]
["Kossuth County, IA","99916"]
["La Crosse County, WI","29100"]
["La Moure County, ND","99935"]
["La Plata County, CO","99906"]
["La Porte County, IN","33140"]
["La Salle County, IL","99914"]
["La Salle County, TX","99945"]
["La Salle Parish, LA","99919"]
["Labette County, KS","99917"]
["Lac Qui Parle County, MN","99924"]
["Lackawanna County, PA","42540"]
["Laclede County, MO","99926"]
["Lafayette County, AR","99904"]
["Lafayette County, FL","99910"]
["Lafayette County, MO","28140"]
["Lafayette County, MS","99925"]
["Lafayette County, WI","99952"]
["Lafayette Parish, LA","29180"]
["Lafourche Parish, LA","26380"]
["Lagrange County, IN","99915"]
["Lajas Municipio, PR","41900"]
["Lake And Peninsula Borough, AK","99902"]
["Lake County, CA","99905"]
["Lake County, CO","99906"]
["Lake County, FL","36740"]
["Lake County, IL","29404"]
["Lake County, IN","23844"]
["Lake County, MI","99923"]
["Lake County, MN","99924"]
["Lake County, MT","99927"]
["Lake County, OH","17460"]
["Lake County, OR","99938"]
["Lake County, SD","99943"]
["Lake County, TN","99944"]
["Lake Of Woods County, MN","99924"]
["Lamar County, AL","99901"]
["Lamar County, GA","12060"]
["Lamar County, MS","25620"]
["Lamar County, TX","99945"]
["Lamb County, TX","99945"]
["Lamoille County, VT","99947"]
["Lampasas County, TX","28660"]
["Lancaster County, NE","30700"]
["Lancaster County, PA","29540"]
["Lancaster County, SC","16740"]
["Lancaster County, VA","99949"]
["Lander County, NV","99929"]
["Lane County, KS","99917"]
["Lane County, OR","21660"]
["Langlade County, WI","99952"]
["Lanier County, GA","46660"]
["Lapaz County, AZ","99903"]
["Lapeer County, MI","47664"]
["Laramie County, WY","16940"]
["Lares Municipio, PR","10380"]
["Larimer County, CO","22660"]
["Larue County, KY","21060"]
["Las Animas County, CO","99906"]
["Las Marias Municipio, PR","99940"]
["Las Piedras Municipio, PR","41980"]
["LaSalle County, IL","99914"]
["Lassen County, CA","99905"]
["Latah County, ID","99913"]
["Latimer County, OK","99937"]
["Lauderdale County, AL","22520"]
["Lauderdale County, MS","99925"]
["Lauderdale County, TN","99944"]
["Laurel County, KY","99918"]
["Laurens County, GA","99911"]
["Laurens County, SC","24860"]
["Lavaca County, TX","99945"]
["Lawrence County, AL","19460"]
["Lawrence County, AR","99904"]
["Lawrence County, IL","99914"]
["Lawrence County, IN","99915"]
["Lawrence County, KY","99918"]
["Lawrence County, MO","99926"]
["Lawrence County, MS","99925"]
["Lawrence County, OH","26580"]
["Lawrence County, PA","99939"]
["Lawrence County, SD","99943"]
["Lawrence County, TN","99944"]
["Le Flore County, OK","22900"]
["Le Sueur County, MN","33460"]
["Lea County, NM","99932"]
["Leake County, MS","99925"]
["Leavenworth County, KS","28140"]
["Lebanon County, PA","30140"]
["Lee County, AL","12220"]
["Lee County, AR","99904"]
["Lee County, FL","15980"]
["Lee County, GA","10500"]
["Lee County, IA","99916"]
["Lee County, IL","99914"]
["Lee County, KY","99918"]
["Lee County, MS","99925"]
["Lee County, NC","99934"]
["Lee County, SC","99942"]
["Lee County, TX","99945"]
["Lee County, VA","99949"]
["Leelanau County, MI","99923"]
["Leflore County, MS","99925"]
["Lehigh County, PA","10900"]
["Lemhi County, ID","99913"]
["Lenawee County, MI","99923"]
["Lenoir County, NC","99934"]
["Leon County, FL","45220"]
["Leon County, TX","99945"]
["Leslie County, KY","99918"]
["Letcher County, KY","99918"]
["Levy County, FL","99910"]
["Lewis And Clark County, MT","99927"]
["Lewis County, ID","99913"]
["Lewis County, KY","99918"]
["Lewis County, MO","99926"]
["Lewis County, NY","99933"]
["Lewis County, TN","99944"]
["Lewis County, WA","99950"]
["Lewis County, WV","99951"]
["Lexington City County, VA","99949"]
["Lexington County, SC","17900"]
["Liberty County, FL","99910"]
["Liberty County, GA","25980"]
["Liberty County, MT","99927"]
["Liberty County, TX","26420"]
["Licking County, OH","18140"]
["Limestone County, AL","26620"]
["Limestone County, TX","99945"]
["Lincoln County, AR","38220"]
["Lincoln County, CO","99906"]
["Lincoln County, GA","12260"]
["Lincoln County, ID","99913"]
["Lincoln County, KS","99917"]
["Lincoln County, KY","99918"]
["Lincoln County, ME","99920"]
["Lincoln County, MN","99924"]
["Lincoln County, MO","41180"]
["Lincoln County, MS","99925"]
["Lincoln County, MT","99927"]
["Lincoln County, NC","16740"]
["Lincoln County, NE","99928"]
["Lincoln County, NM","99932"]
["Lincoln County, NV","99929"]
["Lincoln County, OK","36420"]
["Lincoln County, OR","99938"]
["Lincoln County, SD","43620"]
["Lincoln County, TN","99944"]
["Lincoln County, WA","99950"]
["Lincoln County, WI","99952"]
["Lincoln County, WV","26580"]
["Lincoln County, WY","99953"]
["Lincoln Parish, LA","99919"]
["Linn County, IA","16300"]
["Linn County, KS","28140"]
["Linn County, MO","99926"]
["Linn County, OR","10540"]
["Lipscomb County, TX","99945"]
["Litchfield County, CT","99907"]
["Little River County, AR","45500"]
["Live Oak County, TX","99945"]
["Livingston County, IL","99914"]
["Livingston County, KY","99918"]
["Livingston County, MI","47664"]
["Livingston County, MO","99926"]
["Livingston County, NY","40380"]
["Livingston Parish, LA","12940"]
["Llano County, TX","99945"]
["Logan County, AR","99904"]
["Logan County, CO","99906"]
["Logan County, IL","99914"]
["Logan County, KS","99917"]
["Logan County, KY","99918"]
["Logan County, ND","99935"]
["Logan County, NE","99928"]
["Logan County, OH","99936"]
["Logan County, OK","36420"]
["Logan County, WV","99951"]
["Loiza Municipio, PR","41980"]
["Long County, GA","25980"]
["Lonoke County, AR","30780"]
["Lorain County, OH","17460"]
["Los Alamos County, NM","99932"]
["Los Angeles County, CA","31084"]
["Los Angeles County, CA","31084"]
["Loudon County, TN","28940"]
["Loudoun County, VA","47894"]
["Louisa County, IA","99916"]
["Louisa County, VA","99949"]
["Loup County, NE","99928"]
["Love County, OK","99937"]
["Loving County, TX","99945"]
["Lowndes County, AL","33860"]
["Lowndes County, GA","46660"]
["Lowndes County, MS","99925"]
["Lubbock County, TX","31180"]
["Lucas County, IA","99916"]
["Lucas County, OH","45780"]
["Luce County, MI","99923"]
["Lumpkin County, GA","99911"]
["Luna County, NM","99932"]
["Lunenburg County, VA","99949"]
["Luquillo Municipio, PR","41980"]
["Luzerne County, PA","42540"]
["Lycoming County, PA","48700"]
["Lyman County, SD","99943"]
["Lynchburg City County, VA","31340"]
["Lynn County, TX","31180"]
["Lyon County, IA","99916"]
["Lyon County, KS","99917"]
["Lyon County, KY","99918"]
["Lyon County, MN","99924"]
["Lyon County, NV","99929"]
["Mackinac County, MI","99923"]
["Macomb County, MI","47664"]
["Macon County, AL","99901"]
["Macon County, GA","99911"]
["Macon County, IL","19500"]
["Macon County, MO","99926"]
["Macon County, NC","99934"]
["Macon County, TN","34980"]
["Macoupin County, IL","41180"]
["Madera County, CA","31460"]
["Madison County, AL","26620"]
["Madison County, AR","22220"]
["Madison County, FL","99910"]
["Madison County, GA","12020"]
["Madison County, IA","19780"]
["Madison County, ID","99913"]
["Madison County, IL","41180"]
["Madison County, IN","26900"]
["Madison County, KY","99918"]
["Madison County, MO","99926"]
["Madison County, MS","27140"]
["Madison County, MT","99927"]
["Madison County, NC","11700"]
["Madison County, NE","99928"]
["Madison County, NY","45060"]
["Madison County, OH","18140"]
["Madison County, TN","27180"]
["Madison County, TX","99945"]
["Madison County, VA","99949"]
["Madison Parish, LA","99919"]
["Magoffin County, KY","99918"]
["Maguabo Municipio, PR","41980"]
["Mahaska County, IA","99916"]
["Mahnomen County, MN","99924"]
["Mahoning County, OH","49660"]
["Major County, OK","99937"]
["Malheur County, OR","99938"]
["Manassas City County, VA","47894"]
["Manassas Park City County, VA","47894"]
["Manatee County, FL","35840"]
["Manati Municipio, PR","41980"]
["Manistee County, MI","99923"]
["Manitowoc County, WI","99952"]
["Marathon County, WI","48140"]
["Marengo County, AL","99901"]
["Maricao Municipio, PR","99940"]
["Maricopa County, AZ","38060"]
["Maries County, MO","99926"]
["Marin County, CA","42034"]
["Marinette County, WI","99952"]
["Marion County, AL","99901"]
["Marion County, AR","99904"]
["Marion County, FL","36100"]
["Marion County, GA","17980"]
["Marion County, IA","99916"]
["Marion County, IL","99914"]
["Marion County, IN","26900"]
["Marion County, KS","99917"]
["Marion County, KY","99918"]
["Marion County, MO","99926"]
["Marion County, MS","99925"]
["Marion County, OH","99936"]
["Marion County, OR","41420"]
["Marion County, SC","99942"]
["Marion County, TN","16860"]
["Marion County, TX","99945"]
["Marion County, WV","99951"]
["Mariposa County, CA","99905"]
["Marlboro County, SC","99942"]
["Marquette County, MI","99923"]
["Marquette County, WI","99952"]
["Marshall County, AL","99901"]
["Marshall County, IA","99916"]
["Marshall County, IL","37900"]
["Marshall County, IN","99915"]
["Marshall County, KS","99917"]
["Marshall County, KY","99918"]
["Marshall County, MN","99924"]
["Marshall County, MS","32820"]
["Marshall County, OK","99937"]
["Marshall County, SD","99943"]
["Marshall County, TN","99944"]
["Marshall County, WV","48540"]
["Martin County, FL","38940"]
["Martin County, IN","99915"]
["Martin County, KY","99918"]
["Martin County, MN","99924"]
["Martin County, NC","99934"]
["Martin County, TX","33260"]
["Martinsville City County, VA","99949"]
["Mason County, IL","99914"]
["Mason County, KY","99918"]
["Mason County, MI","99923"]
["Mason County, TX","99945"]
["Mason County, WA","99950"]
["Mason County, WV","99951"]
["Massac County, IL","99914"]
["Matagorda County, TX","99945"]
["Matanuska-Susitna Municipality, AK","11260"]
["Mathews County, VA","47260"]
["Maui County, HI","27980"]
["Maunabo Municipio, PR","41980"]
["Maury County, TN","34980"]
["Maverick County, TX","99945"]
["Mayaguez Municipio, PR","32420"]
["Mayes County, OK","99937"]
["Mc Cook County, SD","43620"]
["Mc Cracken County, KY","99918"]
["Mc Creary County, KY","99918"]
["Mc Culloch County, TX","99945"]
["Mc Donald County, MO","22220"]
["Mc Donough County, IL","99914"]
["Mc Dowell County, NC","99934"]
["Mc Dowell County, WV","99951"]
["Mc Henry County, IL","16974"]
["Mc Intosh County, GA","15260"]
["Mc Kean County, PA","99939"]
["Mc Lean County, KY","36980"]
["Mc Lennan County, TX","47380"]
["Mc Leod County, MN","99924"]
["Mc Minn County, TN","99944"]
["Mc Mullen County, TX","99945"]
["Mc Nairy County, TN","99944"]
["Mc Pherson County, NE","99928"]
["Mc Pherson County, SD","99943"]
["Mcclain County, OK","36420"]
["Mccone County, MT","99927"]
["Mccormick County, SC","99942"]
["Mccurtain County, OK","99937"]
["McDuffie County, GA","12260"]
["Mchenry County, ND","99935"]
["Mcintosh County, ND","99935"]
["Mcintosh County, OK","99937"]
["Mckenzie County, ND","99935"]
["Mckinley County, NM","99932"]
["McLean County, IL","14010"]
["Mclean County, ND","99935"]
["Mcpherson County, KS","99917"]
["Meade County, KS","99917"]
["Meade County, KY","21060"]
["Meade County, SD","39660"]
["Meagher County, MT","99927"]
["Mecklenburg County, NC","16740"]
["Mecklenburg County, VA","99949"]
["Mecosta County, MI","99923"]
["Medina County, OH","17460"]
["Medina County, TX","41700"]
["Meeker County, MN","99924"]
["Meigs County, OH","99936"]
["Meigs County, TN","99944"]
["Mellette County, SD","99943"]
["Menard County, IL","44100"]
["Menard County, TX","99945"]
["Mendocino County, CA","99905"]
["Menifee County, KY","99918"]
["Menominee County, MI","99923"]
["Menomonee County, WI","99952"]
["Merced County, CA","32900"]
["Mercer County, IL","19340"]
["Mercer County, KY","99918"]
["Mercer County, MO","99926"]
["Mercer County, ND","99935"]
["Mercer County, NJ","45940"]
["Mercer County, OH","99936"]
["Mercer County, PA","49660"]
["Mercer County, WV","99951"]
["Meriwether County, GA","12060"]
["Merrick County, NE","24260"]
["Merrimack County, NH","99930"]
["Mesa County, CO","24300"]
["Metcalfe County, KY","99918"]
["Miami County, IN","99915"]
["Miami County, KS","28140"]
["Miami County, OH","19380"]
["Miami-Dade County, FL","33124"]
["Middlesex County, CT","25540"]
["Middlesex County, MA","15764"]
["Middlesex County, NJ","35614"]
["Middlesex County, VA","99949"]
["Midland County, MI","33220"]
["Midland County, TX","33260"]
["Mifflin County, PA","99939"]
["Milam County, TX","99945"]
["Millard County, UT","99946"]
["Mille Lacs County, MN","33460"]
["Miller County, AR","45500"]
["Miller County, GA","99911"]
["Miller County, MO","99926"]
["Mills County, IA","36540"]
["Mills County, TX","99945"]
["Milwaukee County, WI","33340"]
["Miner County, SD","99943"]
["Mineral County, CO","99906"]
["Mineral County, MT","99927"]
["Mineral County, NV","99929"]
["Mineral County, WV","19060"]
["Mingo County, WV","99951"]
["Minidoka County, ID","99913"]
["Minnehaha County, SD","43620"]
["Missaukee County, MI","99923"]
["Mississippi County, AR","99904"]
["Mississippi County, MO","99926"]
["Missoula County, MT","33540"]
["Mitchell County, GA","99911"]
["Mitchell County, IA","99916"]
["Mitchell County, KS","99917"]
["Mitchell County, NC","99934"]
["Mitchell County, TX","99945"]
["Mobile County, AL","33660"]
["Moca Municipio, PR","10380"]
["Modoc County, CA","99905"]
["Moffat County, CO","99906"]
["Mohave County, AZ","29420"]
["Moniteau County, MO","27620"]
["Monmouth County, NJ","35614"]
["Mono County, CA","99905"]
["Monona County, IA","99916"]
["Monongalia County, WV","34060"]
["Monroe County, AL","99901"]
["Monroe County, AR","99904"]
["Monroe County, FL","99910"]
["Monroe County, GA","31420"]
["Monroe County, IA","99916"]
["Monroe County, IL","41180"]
["Monroe County, IN","14020"]
["Monroe County, KY","99918"]
["Monroe County, MI","33780"]
["Monroe County, MO","99926"]
["Monroe County, MS","99925"]
["Monroe County, NY","40380"]
["Monroe County, OH","99936"]
["Monroe County, PA","20700"]
["Monroe County, TN","99944"]
["Monroe County, WI","99952"]
["Monroe County, WV","99951"]
["Montague County, TX","99945"]
["Montcalm County, MI","24340"]
["Monterey County, CA","41500"]
["Montezuma County, CO","99906"]
["Montgomery County, AL","33860"]
["Montgomery County, AR","99904"]
["Montgomery County, GA","99911"]
["Montgomery County, IA","99916"]
["Montgomery County, IL","99914"]
["Montgomery County, IN","99915"]
["Montgomery County, KS","99917"]
["Montgomery County, KY","99918"]
["Montgomery County, MD","43524"]
["Montgomery County, MO","99926"]
["Montgomery County, MS","99925"]
["Montgomery County, NC","99934"]
["Montgomery County, NY","99933"]
["Montgomery County, OH","19380"]
["Montgomery County, PA","33874"]
["Montgomery County, TN","17300"]
["Montgomery County, TX","26420"]
["Montgomery County, VA","13980"]
["Montmorency County, MI","99923"]
["Montour County, PA","14100"]
["Montrose County, CO","99906"]
["Moody County, SD","99943"]
["Moore County, NC","99934"]
["Moore County, TN","99944"]
["Moore County, TX","99945"]
["Mora County, NM","99932"]
["Morehouse Parish, LA","99919"]
["Morgan County, AL","19460"]
["Morgan County, CO","99906"]
["Morgan County, GA","12060"]
["Morgan County, IL","99914"]
["Morgan County, IN","26900"]
["Morgan County, KY","99918"]
["Morgan County, MO","99926"]
["Morgan County, OH","99936"]
["Morgan County, TN","28940"]
["Morgan County, UT","36260"]
["Morgan County, WV","99951"]
["Morovis Municipio, PR","41980"]
["Morrill County, NE","99928"]
["Morris County, KS","99917"]
["Morris County, NJ","35084"]
["Morris County, TX","99945"]
["Morrison County, MN","99924"]
["Morrow County, OH","18140"]
["Morrow County, OR","99938"]
["Morton County, KS","99917"]
["Morton County, ND","13900"]
["Motley County, TX","99945"]
["Moultrie County, IL","99914"]
["Mountrail County, ND","99935"]
["Mower County, MN","99924"]
["Muhlenberg County, KY","99918"]
["Multnomah County, OR","38900"]
["Murray County, GA","19140"]
["Murray County, MN","99924"]
["Murray County, OK","99937"]
["Muscatine County, IA","99916"]
["Muscogee County, GA","17980"]
["Muskegon County, MI","34740"]
["Muskingum County, OH","99936"]
["Muskogee County, OK","99937"]
["Musselshell County, MT","99927"]
["Nacogdoches County, TX","99945"]
["Nance County, NE","99928"]
["Nantucket County, MA","99922"]
["Napa County, CA","34900"]
["Naranjito Municipio, PR","41980"]
["Nash County, NC","40580"]
["Nassau County, FL","27260"]
["Nassau County, NY","35004"]
["Natchitoches Parish, LA","99919"]
["Natrona County, WY","16220"]
["Navajo County, AZ","99903"]
["Navarro County, TX","99945"]
["Nelson County, KY","99918"]
["Nelson County, ND","99935"]
["Nelson County, VA","16820"]
["Nemaha County, KS","99917"]
["Nemaha County, NE","99928"]
["Neosho County, KS","99917"]
["Neshoba County, MS","99925"]
["Ness County, KS","99917"]
["Nevada County, AR","99904"]
["Nevada County, CA","99905"]
["New Castle County, DE","48864"]
["New Hanover County, NC","48900"]
["New Haven County, CT","35300"]
["New Kent County, VA","40060"]
["New London County, CT","35980"]
["New Madrid County, MO","99926"]
["New York County, NY","35614"]
["Newaygo County, MI","99923"]
["Newberry County, SC","99942"]
["Newport County, RI","39300"]
["Newport News City County, VA","47260"]
["Newton County, AR","99904"]
["Newton County, GA","12060"]
["Newton County, IN","23844"]
["Newton County, MO","27900"]
["Newton County, MS","99925"]
["Newton County, TX","13140"]
["Nez Perce County, ID","30300"]
["Niagara County, NY","15380"]
["Nicholas County, KY","99918"]
["Nicholas County, WV","99951"]
["Nicollet County, MN","31860"]
["Niobrara County, WY","99953"]
["Noble County, IN","99915"]
["Noble County, OH","99936"]
["Noble County, OK","99937"]
["Nobles County, MN","99924"]
["Nodaway County, MO","99926"]
["Nolan County, TX","99945"]
["Nome Borough, AK","99902"]
["Norfolk City County, VA","47260"]
["Norfolk County, MA","14454"]
["Norman County, MN","99924"]
["North Slope Borough, AK","99902"]
["Northampton County, NC","99934"]
["Northampton County, PA","10900"]
["Northampton County, VA","99949"]
["Northumberlnd County, PA","99939"]
["Northumberlnd County, VA","99949"]
["Northwest Artic Borough, AK","99902"]
["Norton City County, VA","99949"]
["Norton County, KS","99917"]
["Nottoway County, VA","99949"]
["Nowata County, OK","99937"]
["Noxubee County, MS","99925"]
["Nuckolls County, NE","99928"]
["Nueces County, TX","18580"]
["Nye County, NV","99929"]
["Oakland County, MI","47664"]
["Obion County, TN","99944"]
["Obrien County, IA","99916"]
["Ocean County, NJ","35614"]
["Oceana County, MI","99923"]
["Ochiltree County, TX","99945"]
["Oconee County, GA","12020"]
["Oconee County, SC","99942"]
["Oconto County, WI","24580"]
["Ogemaw County, MI","99923"]
["Ogle County, IL","99914"]
["Oglethorpe County, GA","12020"]
["Ohio County, IN","17140"]
["Ohio County, KY","99918"]
["Ohio County, WV","48540"]
["Okaloosa County, FL","18880"]
["Okanogan County, WA","99950"]
["Okeechobee County, FL","99910"]
["Okfuskee County, OK","99937"]
["Oklahoma County, OK","36420"]
["Okmulgee County, OK","46140"]
["Oktibbeha County, MS","99925"]
["Oldham County, KY","31140"]
["Oldham County, TX","11100"]
["Oliver County, ND","13900"]
["Olmsted County, MN","40340"]
["Oneida County, ID","99913"]
["Oneida County, NY","46540"]
["Oneida County, WI","99952"]
["Onondaga County, NY","45060"]
["Onslow County, NC","27340"]
["Ontario County, NY","40380"]
["Ontonagon County, MI","99923"]
["Orange County, CA","11244"]
["Orange County, FL","36740"]
["Orange County, IN","99915"]
["Orange County, NC","20500"]
["Orange County, NY","35614"]
["Orange County, TX","13140"]
["Orange County, VA","99949"]
["Orange County, VT","99947"]
["Orangeburg County, SC","99942"]
["Oregon County, MO","99926"]
["Orleans County, NY","40380"]
["Orleans County, VT","99947"]
["Orleans Parish, LA","35380"]
["Orocovis Municipio, PR","41980"]
["Osage County, KS","45820"]
["Osage County, MO","27620"]
["Osage County, OK","46140"]
["Osborne County, KS","99917"]
["Osceola County, FL","36740"]
["Osceola County, IA","99916"]
["Osceola County, MI","99923"]
["Oscoda County, MI","99923"]
["Oswego County, NY","45060"]
["Otero County, CO","99906"]
["Otero County, NM","99932"]
["Otoe County, NE","99928"]
["Otsego County, MI","99923"]
["Otsego County, NY","99933"]
["Ottawa County, KS","99917"]
["Ottawa County, MI","24340"]
["Ottawa County, OH","99936"]
["Ottawa County, OK","99937"]
["Otter Tail County, MN","99924"]
["Ouachita County, AR","99904"]
["Ouachita Parish, LA","33740"]
["Ouray County, CO","99906"]
["Outagamie County, WI","11540"]
["Overton County, TN","99944"]
["Owen County, IN","14020"]
["Owen County, KY","99918"]
["Owsley County, KY","99918"]
["Owyhee County, ID","14260"]
["Oxford County, ME","99920"]
["Ozark County, MO","99926"]
["Ozaukee County, WI","33340"]
["Pacific County, WA","99950"]
["Page County, IA","99916"]
["Page County, VA","99949"]
["Palm Beach County, FL","48424"]
["Palo Alto County, IA","99916"]
["Palo Pinto County, TX","99945"]
["Pamlico County, NC","35100"]
["Panola County, MS","99925"]
["Panola County, TX","99945"]
["Park County, CO","19740"]
["Park County, MT","99927"]
["Park County, WY","99953"]
["Parke County, IN","99915"]
["Parker County, TX","23104"]
["Parmer County, TX","99945"]
["Pasco County, FL","45300"]
["Pasquotank County, NC","99934"]
["Passaic County, NJ","35614"]
["Patillas Municipio, PR","25020"]
["Patrick County, VA","99949"]
["Paulding County, GA","12060"]
["Paulding County, OH","99936"]
["Pawnee County, KS","99917"]
["Pawnee County, NE","99928"]
["Pawnee County, OK","46140"]
["Payette County, ID","99913"]
["Payne County, OK","99937"]
["Peach County, GA","47580"]
["Pearl River County, MS","99925"]
["Pecos County, TX","99945"]
["Pembina County, ND","99935"]
["Pemiscot County, MO","99926"]
["Pend Oreille County, WA","44060"]
["Pender County, NC","48900"]
["Pendleton County, KY","17140"]
["Pendleton County, WV","99951"]
["Pennington County, MN","99924"]
["Pennington County, SD","39660"]
["Penobscot County, ME","12620"]
["Penuelas Municipio, PR","38660"]
["Peoria County, IL","37900"]
["Pepin County, WI","99952"]
["Perkins County, NE","99928"]
["Perkins County, SD","99943"]
["Perquimans County, NC","99934"]
["Perry County, AL","99901"]
["Perry County, AR","30780"]
["Perry County, IL","99914"]
["Perry County, IN","99915"]
["Perry County, KY","99918"]
["Perry County, MO","99926"]
["Perry County, MS","25620"]
["Perry County, OH","18140"]
["Perry County, PA","25420"]
["Perry County, TN","99944"]
["Pershing County, NV","99929"]
["Person County, NC","20500"]
["Petersburg Census Area, AK","99902"]
["Petersburg City County, VA","40060"]
["Petroleum County, MT","99927"]
["Pettis County, MO","99926"]
["Phelps County, MO","99926"]
["Phelps County, NE","99928"]
["Philadelphia County, PA","37964"]
["Phillips County, AR","99904"]
["Phillips County, CO","99906"]
["Phillips County, KS","99917"]
["Phillips County, MT","99927"]
["Piatt County, IL","16580"]
["Pickaway County, OH","18140"]
["Pickens County, AL","46220"]
["Pickens County, GA","12060"]
["Pickens County, SC","24860"]
["Pickett County, TN","99944"]
["Pierce County, GA","99911"]
["Pierce County, ND","99935"]
["Pierce County, NE","99928"]
["Pierce County, WA","45104"]
["Pierce County, WI","33460"]
["Pike County, AL","99901"]
["Pike County, AR","99904"]
["Pike County, GA","12060"]
["Pike County, IL","99914"]
["Pike County, IN","99915"]
["Pike County, KY","99918"]
["Pike County, MO","99926"]
["Pike County, MS","99925"]
["Pike County, OH","99936"]
["Pike County, PA","35084"]
["Pima County, AZ","46060"]
["Pinal County, AZ","38060"]
["Pine County, MN","99924"]
["Pinellas County, FL","45300"]
["Pipestone County, MN","99924"]
["Piscataquis County, ME","99920"]
["Pitkin County, CO","99906"]
["Pitt County, NC","24780"]
["Pittsburg County, OK","99937"]
["Pittsylvania County, VA","99949"]
["Piute County, UT","99946"]
["Placer County, CA","40900"]
["Plaquemines Parish, LA","35380"]
["Platte County, MO","28140"]
["Platte County, NE","99928"]
["Platte County, WY","99953"]
["Pleasants County, WV","99951"]
["Plumas County, CA","99905"]
["Plymouth County, IA","43580"]
["Plymouth County, MA","14454"]
["Pocahontas County, IA","99916"]
["Pocahontas County, WV","99951"]
["Poinsett County, AR","27860"]
["Pointe Coupee Parish, LA","12940"]
["Polk County, AR","99904"]
["Polk County, FL","29460"]
["Polk County, GA","99911"]
["Polk County, IA","19780"]
["Polk County, MN","24220"]
["Polk County, MO","44180"]
["Polk County, NC","99934"]
["Polk County, NE","99928"]
["Polk County, OR","41420"]
["Polk County, TN","17420"]
["Polk County, TX","99945"]
["Polk County, WI","99952"]
["Ponce Municipio, PR","38660"]
["Pondera County, MT","99927"]
["Pontotoc County, MS","99925"]
["Pontotoc County, OK","99937"]
["Pope County, AR","99904"]
["Pope County, IL","99914"]
["Pope County, MN","99924"]
["Poquoson County, VA","47260"]
["Portage County, OH","10420"]
["Portage County, WI","99952"]
["Porter County, IN","23844"]
["Portsmouth City County, VA","47260"]
["Posey County, IN","21780"]
["Pottawatomie County, KS","31740"]
["Pottawatomie County, OK","99937"]
["Pottawattamie County, IA","36540"]
["Potter County, PA","99939"]
["Potter County, SD","99943"]
["Potter County, TX","11100"]
["Powder River County, MT","99927"]
["Powell County, KY","99918"]
["Powell County, MT","99927"]
["Power County, ID","99913"]
["Poweshiek County, IA","99916"]
["Powhatan County, VA","40060"]
["Pr.Of Wales-Hyder Census Area, AK","99902"]
["Prairie County, AR","99904"]
["Prairie County, MT","99927"]
["Pratt County, KS","99917"]
["Preble County, OH","99936"]
["Prentiss County, MS","99925"]
["Presidio County, TX","99945"]
["Presque Isle County, MI","99923"]
["Preston County, WV","34060"]
["Price County, WI","99952"]
["Prince Edward County, VA","99949"]
["Prince George County, VA","40060"]
["Prince Georges County, MD","47894"]
["Prince William County, VA","47894"]
["Providence County, RI","39300"]
["Prowers County, CO","99906"]
["Pueblo County, CO","39380"]
["Pulaski County, AR","30780"]
["Pulaski County, GA","47580"]
["Pulaski County, IL","99914"]
["Pulaski County, IN","99915"]
["Pulaski County, KY","99918"]
["Pulaski County, MO","99926"]
["Pulaski County, VA","13980"]
["Pushmataha County, OK","99937"]
["Putnam County, FL","99910"]
["Putnam County, GA","99911"]
["Putnam County, IL","99914"]
["Putnam County, IN","26900"]
["Putnam County, MO","99926"]
["Putnam County, NY","20524"]
["Putnam County, OH","99936"]
["Putnam County, TN","99944"]
["Putnam County, WV","26580"]
["Quay County, NM","99932"]
["Quebradillas Municipio, PR","11640"]
["Queen Annes County, MD","12580"]
["Queens County, NY","35614"]
["Quitman County, GA","99911"]
["Quitman County, MS","99925"]
["Rabun County, GA","99911"]
["Racine County, WI","39540"]
["Radford City County, VA","13980"]
["Rains County, TX","99945"]
["Raleigh County, WV","13220"]
["Ralls County, MO","99926"]
["Ramsey County, MN","33460"]
["Ramsey County, ND","99935"]
["Randall County, TX","11100"]
["Randolph County, AL","99901"]
["Randolph County, AR","99904"]
["Randolph County, GA","99911"]
["Randolph County, IL","99914"]
["Randolph County, IN","99915"]
["Randolph County, MO","99926"]
["Randolph County, NC","24660"]
["Randolph County, WV","99951"]
["Rankin County, MS","27140"]
["Ransom County, ND","99935"]
["Rapides Parish, LA","10780"]
["Rappahannock County, VA","47894"]
["Ravalli County, MT","99927"]
["Rawlins County, KS","99917"]
["Ray County, MO","28140"]
["Reagan County, TX","99945"]
["Real County, TX","99945"]
["Red Lake County, MN","99924"]
["Red River County, TX","99945"]
["Red River Parish, LA","99919"]
["Red Willow County, NE","99928"]
["Redwood County, MN","99924"]
["Reeves County, TX","99945"]
["Refugio County, TX","99945"]
["Reno County, KS","99917"]
["Rensselaer County, NY","10580"]
["Renville County, MN","99924"]
["Renville County, ND","99935"]
["Republic County, KS","99917"]
["Reynolds County, MO","99926"]
["Rhea County, TN","99944"]
["Rice County, KS","99917"]
["Rice County, MN","99924"]
["Rich County, UT","99946"]
["Richardson County, NE","99928"]
["Richland County, IL","99914"]
["Richland County, MT","99927"]
["Richland County, ND","99935"]
["Richland County, OH","31900"]
["Richland County, SC","17900"]
["Richland County, WI","99952"]
["Richland Parish, LA","99919"]
["Richmond City County, VA","40060"]
["Richmond County, GA","12260"]
["Richmond County, NC","99934"]
["Richmond County, NY","35614"]
["Richmond County, VA","99949"]
["Riley County, KS","31740"]
["Rincon Municipio, PR","10380"]
["Ringgold County, IA","99916"]
["Rio Arriba County, NM","99932"]
["Rio Blanco County, CO","99906"]
["Rio Grande County, CO","99906"]
["Rio Grande Municipio, PR","41980"]
["Ripley County, IN","99915"]
["Ripley County, MO","99926"]
["Ritchie County, WV","99951"]
["Riverside County, CA","40140"]
["Roane County, TN","28940"]
["Roane County, WV","99951"]
["Roanoke City County, VA","40220"]
["Roanoke County, VA","40220"]
["Roberts County, SD","99943"]
["Roberts County, TX","99945"]
["Robertson County, KY","99918"]
["Robertson County, TN","34980"]
["Robertson County, TX","17780"]
["Robeson County, NC","99934"]
["Rock County, MN","99924"]
["Rock County, NE","99928"]
["Rock County, WI","27500"]
["Rock Island County, IL","19340"]
["Rockbridge County, VA","99949"]
["Rockcastle County, KY","99918"]
["Rockdale County, GA","12060"]
["Rockingham County, NC","24660"]
["Rockingham County, NH","40484"]
["Rockingham County, VA","25500"]
["Rockland County, NY","35614"]
["Rockwall County, TX","19124"]
["Roger Mills County, OK","99937"]
["Rogers County, OK","46140"]
["Rolette County, ND","99935"]
["Rooks County, KS","99917"]
["Roosevelt County, MT","99927"]
["Roosevelt County, NM","99932"]
["Roscommon County, MI","99923"]
["Roseau County, MN","99924"]
["Rosebud County, MT","99927"]
["Ross County, OH","99936"]
["Routt County, CO","99906"]
["Rowan County, KY","99918"]
["Rowan County, NC","16740"]
["Runnels County, TX","99945"]
["Rush County, IN","99915"]
["Rush County, KS","99917"]
["Rusk County, TX","30980"]
["Rusk County, WI","99952"]
["Russell County, AL","17980"]
["Russell County, KS","99917"]
["Russell County, KY","99918"]
["Russell County, VA","99949"]
["Rutherford County, NC","99934"]
["Rutherford County, TN","34980"]
["Rutland County, VT","99947"]
["Sabana Grande Municipio, PR","41900"]
["Sabine County, TX","99945"]
["Sabine Parish, LA","99919"]
["Sac County, IA","99916"]
["Sacramento County, CA","40900"]
["Sagadahoc County, ME","38860"]
["Saginaw County, MI","40980"]
["Saguache County, CO","99906"]
["Salem City County, VA","40220"]
["Salem County, NJ","48864"]
["Salinas Municipio, PR","99940"]
["Saline County, AR","30780"]
["Saline County, IL","99914"]
["Saline County, KS","99917"]
["Saline County, MO","99926"]
["Saline County, NE","99928"]
["Salt Lake County, UT","41620"]
["Saluda County, SC","17900"]
["Sampson County, NC","99934"]
["San Augustine County, TX","99945"]
["San Benito County, CA","41940"]
["San Bernardino County, CA","40140"]
["San Diego County, CA","41740"]
["San Francisco County, CA","41884"]
["San German Municipio, PR","41900"]
["San Jacinto County, TX","99945"]
["San Joaquin County, CA","44700"]
["San Juan County, CO","99906"]
["San Juan County, NM","22140"]
["San Juan County, UT","99946"]
["San Juan County, WA","99950"]
["San Juan Municipio, PR","41980"]
["San Lorenzo Municipio, PR","41980"]
["San Luis Obispo County, CA","42020"]
["San Mateo County, CA","41884"]
["San Miguel County, CO","99906"]
["San Miguel County, NM","99932"]
["San Patricio County, TX","18580"]
["San Saba County, TX","99945"]
["San Sebastian Municipio, PR","10380"]
["Sanborn County, SD","99943"]
["Sanders County, MT","99927"]
["Sandoval County, NM","10740"]
["Sandusky County, OH","99936"]
["Sangamon County, IL","44100"]
["Sanilac County, MI","99923"]
["Sanpete County, UT","99946"]
["Santa Barbara County, CA","42200"]
["Santa Clara County, CA","41940"]
["Santa Cruz County, AZ","99903"]
["Santa Cruz County, CA","42100"]
["Santa Fe County, NM","42140"]
["Santa Isabel Municipio, PR","99940"]
["Santa Rosa County, FL","37860"]
["Sarasota County, FL","35840"]
["Saratoga County, NY","10580"]
["Sargent County, ND","99935"]
["Sarpy County, NE","36540"]
["Sauk County, WI","99952"]
["Saunders County, NE","36540"]
["Sawyer County, WI","99952"]
["Schenectady County, NY","10580"]
["Schleicher County, TX","99945"]
["Schley County, GA","99911"]
["Schoharie County, NY","10580"]
["Schoolcraft County, MI","99923"]
["Schuyler County, IL","99914"]
["Schuyler County, MO","99926"]
["Schuyler County, NY","99933"]
["Schuylkill County, PA","99939"]
["Scioto County, OH","99936"]
["Scotland County, MO","99926"]
["Scotland County, NC","99934"]
["Scott Bluff County, NE","99928"]
["Scott County, AR","99904"]
["Scott County, IA","19340"]
["Scott County, IL","99914"]
["Scott County, IN","31140"]
["Scott County, KS","99917"]
["Scott County, KY","30460"]
["Scott County, MN","33460"]
["Scott County, MO","99926"]
["Scott County, MS","99925"]
["Scott County, TN","99944"]
["Scott County, VA","28700"]
["Screven County, GA","99911"]
["Scurry County, TX","99945"]
["Searcy County, AR","99904"]
["Sebastian County, AR","22900"]
["Sedgwick County, CO","99906"]
["Sedgwick County, KS","48620"]
["Seminole County, FL","36740"]
["Seminole County, GA","99911"]
["Seminole County, OK","99937"]
["Seneca County, NY","99933"]
["Seneca County, OH","99936"]
["Sequatchie County, TN","16860"]
["Sequoyah County, OK","22900"]
["Sevier County, AR","99904"]
["Sevier County, TN","99944"]
["Sevier County, UT","99946"]
["Seward County, KS","99917"]
["Seward County, NE","30700"]
["Shackelford County, TX","99945"]
["Shannon County, MO","99926"]
["Shannon County, SD","99943"]
["Sharkey County, MS","99925"]
["Sharp County, AR","99904"]
["Shasta County, CA","39820"]
["Shawano County, WI","99952"]
["Shawnee County, KS","45820"]
["Sheboygan County, WI","43100"]
["Shelby County, AL","13820"]
["Shelby County, IA","99916"]
["Shelby County, IL","99914"]
["Shelby County, IN","26900"]
["Shelby County, KY","31140"]
["Shelby County, MO","99926"]
["Shelby County, OH","99936"]
["Shelby County, TN","32820"]
["Shelby County, TX","99945"]
["Shenandoah County, VA","99949"]
["Sherburne County, MN","33460"]
["Sheridan County, KS","99917"]
["Sheridan County, MT","99927"]
["Sheridan County, ND","99935"]
["Sheridan County, NE","99928"]
["Sheridan County, WY","99953"]
["Sherman County, KS","99917"]
["Sherman County, NE","99928"]
["Sherman County, OR","99938"]
["Sherman County, TX","99945"]
["Shiawassee County, MI","99923"]
["Shoshone County, ID","99913"]
["Sibley County, MN","33460"]
["Sierra County, CA","99905"]
["Sierra County, NM","99932"]
["Silver Bow County, MT","99927"]
["Simpson County, KY","99918"]
["Simpson County, MS","27140"]
["Sioux County, IA","99916"]
["Sioux County, ND","13900"]
["Sioux County, NE","99928"]
["Siskiyou County, CA","99905"]
["Sitka Borough, AK","99902"]
["Skagit County, WA","34580"]
["Skagway-Yakutat Borough, AK","99902"]
["Skamania County, WA","38900"]
["Slope County, ND","99935"]
["Smith County, KS","99917"]
["Smith County, MS","99925"]
["Smith County, TN","34980"]
["Smith County, TX","46340"]
["Smyth County, VA","99949"]
["Snohomish County, WA","42644"]
["Snyder County, PA","99939"]
["Socorro County, NM","99932"]
["Solano County, CA","46700"]
["Somerset County, MD","41540"]
["Somerset County, ME","99920"]
["Somerset County, NJ","35084"]
["Somerset County, PA","99939"]
["Somervell County, TX","23104"]
["Sonoma County, CA","42220"]
["Southampton County, VA","99949"]
["Southeast Fairbanks Borough, AK","99902"]
["Spalding County, GA","12060"]
["Spartanburg County, SC","43900"]
["Spencer County, IN","99915"]
["Spencer County, KY","31140"]
["Spink County, SD","99943"]
["Spokane County, WA","44060"]
["Spotsylvania County, VA","47894"]
["St. Bernard Parish, LA","35380"]
["St. Charles County, MO","41180"]
["St. Charles Parish, LA","35380"]
["St. Clair County, AL","13820"]
["St. Clair County, IL","41180"]
["St. Clair County, MI","47664"]
["St. Clair County, MO","99926"]
["St. Croix County, WI","33460"]
["St. Francis County, AR","99904"]
["St. Francois County, MO","99926"]
["St. Helena Parish, LA","12940"]
["St. James Parish, LA","35380"]
["St. John Baptist Parish, LA","35380"]
["St. Johns County, FL","27260"]
["St. Joseph County, IN","43780"]
["St. Joseph County, MI","99923"]
["St. Landry Parish, LA","99919"]
["St. Lawrence County, NY","99933"]
["St. Louis City County, MO","41180"]
["St. Louis County, MN","20260"]
["St. Louis County, MO","41180"]
["St. Lucie County, FL","38940"]
["St. Martin Parish, LA","29180"]
["St. Mary Parish, LA","99919"]
["St. Marys County, MD","15680"]
["St. Tammany Parish, LA","35380"]
["st. thomas, VI","99948"]
["Stafford County, KS","99917"]
["Stafford County, VA","47894"]
["Stanislaus County, CA","33700"]
["Stanley County, SD","99943"]
["Stanly County, NC","99934"]
["Stanton County, KS","99917"]
["Stanton County, NE","99928"]
["Stark County, IL","37900"]
["Stark County, ND","99935"]
["Stark County, OH","15940"]
["Starke County, IN","99915"]
["Starr County, TX","99945"]
["Staunton City County, VA","44420"]
["Ste. Genevieve County, MO","99926"]
["Stearns County, MN","41060"]
["Steele County, MN","99924"]
["Steele County, ND","99935"]
["Stephens County, GA","99911"]
["Stephens County, OK","99937"]
["Stephens County, TX","99945"]
["Stephenson County, IL","99914"]
["Sterling County, TX","99945"]
["Steuben County, IN","99915"]
["Steuben County, NY","99933"]
["Stevens County, KS","99917"]
["Stevens County, MN","99924"]
["Stevens County, WA","44060"]
["Stewart County, GA","99911"]
["Stewart County, TN","99944"]
["Stillwater County, MT","99927"]
["Stoddard County, MO","99926"]
["Stokes County, NC","49180"]
["Stone County, AR","99904"]
["Stone County, MO","99926"]
["Stone County, MS","99925"]
["Stonewall County, TX","99945"]
["Storey County, NV","39900"]
["Story County, IA","11180"]
["Strafford County, NH","40484"]
["Stutsman County, ND","99935"]
["Sublette County, WY","99953"]
["Suffolk City County, VA","47260"]
["Suffolk County, MA","14454"]
["Suffolk County, NY","35004"]
["Sullivan County, IN","45460"]
["Sullivan County, MO","99926"]
["Sullivan County, NH","99930"]
["Sullivan County, NY","99933"]
["Sullivan County, PA","99939"]
["Sullivan County, TN","28700"]
["Sully County, SD","99943"]
["Summers County, WV","99951"]
["Summit County, CO","99906"]
["Summit County, OH","10420"]
["Summit County, UT","99946"]
["Sumner County, KS","48620"]
["Sumner County, TN","34980"]
["Sumter County, AL","99901"]
["Sumter County, FL","45540"]
["Sumter County, GA","99911"]
["Sumter County, SC","44940"]
["Sunflower County, MS","99925"]
["Surry County, NC","99934"]
["Surry County, VA","99949"]
["Susquehanna County, PA","99939"]
["Sussex County, DE","41540"]
["Sussex County, NJ","35084"]
["Sussex County, VA","40060"]
["Sutter County, CA","49700"]
["Sutton County, TX","99945"]
["Suwannee County, FL","99910"]
["Swain County, NC","99934"]
["Sweet Grass County, MT","99927"]
["Sweetwater County, WY","99953"]
["Swift County, MN","99924"]
["Swisher County, TX","99945"]
["Switzerland County, IN","99915"]
["Talbot County, GA","99911"]
["Talbot County, MD","99921"]
["Taliaferro County, GA","99911"]
["Talladega County, AL","99901"]
["Tallahatchie County, MS","99925"]
["Tallapoosa County, AL","99901"]
["Tama County, IA","99916"]
["Taney County, MO","99926"]
["Tangipahoa Parish, LA","25220"]
["Taos County, NM","99932"]
["Tarrant County, TX","23104"]
["Tate County, MS","32820"]
["Tattnall County, GA","99911"]
["Taylor County, FL","99910"]
["Taylor County, GA","99911"]
["Taylor County, IA","99916"]
["Taylor County, KY","99918"]
["Taylor County, TX","10180"]
["Taylor County, WI","99952"]
["Taylor County, WV","99951"]
["Tazewell County, IL","37900"]
["Tazewell County, VA","99949"]
["Tehama County, CA","99905"]
["Telfair County, GA","99911"]
["Teller County, CO","17820"]
["Tensas Parish, LA","99919"]
["Terrebonne Parish, LA","26380"]
["Terrell County, GA","10500"]
["Terrell County, TX","99945"]
["Terry County, TX","99945"]
["Teton County, ID","99913"]
["Teton County, MT","99927"]
["Teton County, WY","99953"]
["Texas County, MO","99926"]
["Texas County, OK","99937"]
["Thayer County, NE","99928"]
["The District County, DC","47894"]
["Thomas County, GA","99911"]
["Thomas County, KS","99917"]
["Thomas County, NE","99928"]
["Throckmorton County, TX","99945"]
["Thurston County, NE","99928"]
["Thurston County, WA","36500"]
["Tift County, GA","99911"]
["Tillamook County, OR","99938"]
["Tillman County, OK","99937"]
["Tioga County, NY","13780"]
["Tioga County, PA","99939"]
["Tippah County, MS","99925"]
["Tippecanoe County, IN","29200"]
["Tipton County, IN","99915"]
["Tipton County, TN","32820"]
["Tishomingo County, MS","99925"]
["Titus County, TX","99945"]
["Toa Alta Municipio, PR","41980"]
["Toa Baja Municipio, PR","41980"]
["Todd County, KY","99918"]
["Todd County, MN","99924"]
["Todd County, SD","99943"]
["Tolland County, CT","25540"]
["Tom Green County, TX","41660"]
["Tompkins County, NY","27060"]
["Tooele County, UT","41620"]
["Toole County, MT","99927"]
["Toombs County, GA","99911"]
["Torrance County, NM","10740"]
["Towner County, ND","99935"]
["Towns County, GA","99911"]
["Traill County, ND","99935"]
["Transylvania County, NC","99934"]
["Traverse County, MN","99924"]
["Travis County, TX","12420"]
["Treasure County, MT","99927"]
["Trego County, KS","99917"]
["Trempealeau County, WI","99952"]
["Treutlen County, GA","99911"]
["Trigg County, KY","17300"]
["Trimble County, KY","31140"]
["Trinity County, CA","99905"]
["Trinity County, TX","99945"]
["Tripp County, SD","99943"]
["Troup County, GA","99911"]
["Trousdale County, TN","34980"]
["Trujillo Alto Municipio, PR","41980"]
["Trumbull County, OH","49660"]
["Tucker County, WV","99951"]
["Tulare County, CA","47300"]
["Tulsa County, OK","46140"]
["Tunica County, MS","32820"]
["Tuolumne County, CA","99905"]
["Turner County, GA","99911"]
["Turner County, SD","43620"]
["Tuscaloosa County, AL","46220"]
["Tuscarawas County, OH","99936"]
["Tuscola County, MI","99923"]
["Twiggs County, GA","31420"]
["Twin Falls County, ID","99913"]
["Tyler County, TX","99945"]
["Tyler County, WV","99951"]
["Tyrrell County, NC","99934"]
["Uinta County, WY","99953"]
["Uintah County, UT","99946"]
["Ulster County, NY","28740"]
["Umatilla County, OR","99938"]
["Unicoi County, TN","27740"]
["Union County, AR","99904"]
["Union County, FL","99910"]
["Union County, GA","99911"]
["Union County, IA","99916"]
["Union County, IL","99914"]
["Union County, IN","17140"]
["Union County, KY","99918"]
["Union County, MS","99925"]
["Union County, NC","16740"]
["Union County, NJ","35084"]
["Union County, NM","99932"]
["Union County, OH","18140"]
["Union County, OR","99938"]
["Union County, PA","99939"]
["Union County, SC","43900"]
["Union County, SD","43580"]
["Union County, TN","28940"]
["Union Parish, LA","33740"]
["Upshur County, TX","30980"]
["Upshur County, WV","99951"]
["Upson County, GA","99911"]
["Upton County, TX","99945"]
["Utah County, UT","39340"]
["Utuado Municipio, PR","10380"]
["Uvalde County, TX","99945"]
["Val Verde County, TX","99945"]
["Valdez-Cordova Borough, AK","99902"]
["Valencia County, NM","10740"]
["Valley County, ID","99913"]
["Valley County, MT","99927"]
["Valley County, NE","99928"]
["Van Buren County, AR","99904"]
["Van Buren County, IA","99916"]
["Van Buren County, MI","28020"]
["Van Buren County, TN","99944"]
["Van Wert County, OH","99936"]
["Van Zandt County, TX","99945"]
["Vance County, NC","99934"]
["Vanderburgh County, IN","21780"]
["Vega Alta Municipio, PR","41980"]
["Vega Baja Municipio, PR","41980"]
["Venango County, PA","99939"]
["Ventura County, CA","37100"]
["Vermilion County, IL","19180"]
["Vermilion Parish, LA","29180"]
["Vermillion County, IN","45460"]
["Vernon County, MO","99926"]
["Vernon County, WI","99952"]
["Vernon Parish, LA","99919"]
["Victoria County, TX","47020"]
["Vieques Municipio, PR","99940"]
["Vigo County, IN","45460"]
["Vilas County, WI","99952"]
["Villalba Municipio, PR","38660"]
["Vinton County, OH","99936"]
["Virginia Beach City County, VA","47260"]
["Volusia County, FL","19660"]
["W. Baton Rouge Parish, LA","12940"]
["Wabash County, IL","99914"]
["Wabash County, IN","99915"]
["Wabasha County, MN","40340"]
["Wabaunsee County, KS","45820"]
["Wade Hampton Borough, AK","99902"]
["Wadena County, MN","99924"]
["Wagoner County, OK","46140"]
["Wahkiakum County, WA","99950"]
["Wake County, NC","39580"]
["Wakulla County, FL","45220"]
["Waldo County, ME","99920"]
["Walker County, AL","13820"]
["Walker County, GA","16860"]
["Walker County, TX","99945"]
["Walla Walla County, WA","47460"]
["Wallace County, KS","99917"]
["Waller County, TX","26420"]
["Wallowa County, OR","99938"]
["Walsh County, ND","99935"]
["Walthall County, MS","99925"]
["Walton County, FL","18880"]
["Walton County, GA","12060"]
["Walworth County, SD","99943"]
["Walworth County, WI","99952"]
["Wapello County, IA","99916"]
["Ward County, ND","99935"]
["Ward County, TX","99945"]
["Ware County, GA","99911"]
["Warren County, GA","99911"]
["Warren County, IA","19780"]
["Warren County, IL","99914"]
["Warren County, IN","99915"]
["Warren County, KY","14540"]
["Warren County, MO","41180"]
["Warren County, MS","99925"]
["Warren County, NC","99934"]
["Warren County, NJ","10900"]
["Warren County, NY","24020"]
["Warren County, OH","17140"]
["Warren County, PA","99939"]
["Warren County, TN","99944"]
["Warren County, VA","47894"]
["Warrick County, IN","21780"]
["Wasatch County, UT","99946"]
["Wasco County, OR","99938"]
["Waseca County, MN","99924"]
["Washakie County, WY","99953"]
["Washburn County, WI","99952"]
["Washington County, AL","99901"]
["Washington County, AR","22220"]
["Washington County, CO","99906"]
["Washington County, FL","99910"]
["Washington County, GA","99911"]
["Washington County, IA","26980"]
["Washington County, ID","99913"]
["Washington County, IL","99914"]
["Washington County, IN","31140"]
["Washington County, KS","99917"]
["Washington County, KY","99918"]
["Washington County, MD","25180"]
["Washington County, ME","99920"]
["Washington County, MN","33460"]
["Washington County, MO","99926"]
["Washington County, MS","99925"]
["Washington County, NC","99934"]
["Washington County, NE","36540"]
["Washington County, NY","24020"]
["Washington County, OH","99936"]
["Washington County, OK","99937"]
["Washington County, OR","38900"]
["Washington County, PA","38300"]
["Washington County, RI","39300"]
["Washington County, TN","27740"]
["Washington County, TX","99945"]
["Washington County, UT","41100"]
["Washington County, VA","28700"]
["Washington County, VT","99947"]
["Washington County, WI","33340"]
["Washington Parish, LA","99919"]
["Washita County, OK","99937"]
["Washoe County, NV","39900"]
["Washtenaw County, MI","11460"]
["Watauga County, NC","99934"]
["Watonwan County, MN","99924"]
["Waukesha County, WI","33340"]
["Waupaca County, WI","99952"]
["Waushara County, WI","99952"]
["Wayne County, GA","99911"]
["Wayne County, IA","99916"]
["Wayne County, IL","99914"]
["Wayne County, IN","99915"]
["Wayne County, KY","99918"]
["Wayne County, MI","19804"]
["Wayne County, MO","99926"]
["Wayne County, MS","99925"]
["Wayne County, NC","24140"]
["Wayne County, NE","99928"]
["Wayne County, NY","40380"]
["Wayne County, OH","99936"]
["Wayne County, PA","99939"]
["Wayne County, TN","99944"]
["Wayne County, UT","99946"]
["Wayne County, WV","26580"]
["Waynesboro City County, VA","44420"]
["Weakley County, TN","99944"]
["Webb County, TX","29700"]
["Weber County, UT","36260"]
["Webster County, GA","99911"]
["Webster County, IA","99916"]
["Webster County, KY","99918"]
["Webster County, MO","44180"]
["Webster County, MS","99925"]
["Webster County, NE","99928"]
["Webster County, WV","99951"]
["Webster Parish, LA","43340"]
["Weld County, CO","24540"]
["Wells County, IN","23060"]
["Wells County, ND","99935"]
["West Carroll Parish, LA","99919"]
["West Feliciana Parish, LA","12940"]
["Westchester County, NY","35614"]
["Westmoreland County, PA","38300"]
["Westmoreland County, VA","99949"]
["Weston County, WY","99953"]
["Wetzel County, WV","99951"]
["Wexford County, MI","99923"]
["Wharton County, TX","99945"]
["Whatcom County, WA","13380"]
["Wheatland County, MT","99927"]
["Wheeler County, GA","99911"]
["Wheeler County, NE","99928"]
["Wheeler County, OR","99938"]
["Wheeler County, TX","99945"]
["White County, AR","99904"]
["White County, GA","99911"]
["White County, IL","99914"]
["White County, IN","99915"]
["White County, TN","99944"]
["White Pine County, NV","99929"]
["Whiteside County, IL","99914"]
["Whitfield County, GA","19140"]
["Whitley County, IN","23060"]
["Whitley County, KY","99918"]
["Whitman County, WA","99950"]
["Wibaux County, MT","99927"]
["Wichita County, KS","99917"]
["Wichita County, TX","48660"]
["Wicomico County, MD","41540"]
["Wilbarger County, TX","99945"]
["Wilcox County, AL","99901"]
["Wilcox County, GA","99911"]
["Wilkes County, GA","99911"]
["Wilkes County, NC","99934"]
["Wilkin County, MN","99924"]
["Wilkinson County, GA","99911"]
["Wilkinson County, MS","99925"]
["Will County, IL","16974"]
["Willacy County, TX","99945"]
["Williams County, ND","99935"]
["Williams County, OH","99936"]
["Williamsburg City County, VA","47260"]
["Williamsburg County, SC","99942"]
["Williamson County, IL","16060"]
["Williamson County, TN","34980"]
["Williamson County, TX","12420"]
["Wilson County, KS","99917"]
["Wilson County, NC","99934"]
["Wilson County, TN","34980"]
["Wilson County, TX","41700"]
["Winchester City County, VA","49020"]
["Windham County, CT","49340"]
["Windham County, VT","99947"]
["Windsor County, VT","99947"]
["Winkler County, TX","99945"]
["Winn Parish, LA","99919"]
["Winnebago County, IA","99916"]
["Winnebago County, IL","40420"]
["Winnebago County, WI","36780"]
["Winneshiek County, IA","99916"]
["Winona County, MN","99924"]
["Winston County, AL","99901"]
["Winston County, MS","99925"]
["Wirt County, WV","37620"]
["Wise County, TX","23104"]
["Wise County, VA","99949"]
["Wolfe County, KY","99918"]
["Wood County, OH","45780"]
["Wood County, TX","99945"]
["Wood County, WI","99952"]
["Wood County, WV","37620"]
["Woodbury County, IA","43580"]
["Woodford County, IL","37900"]
["Woodford County, KY","30460"]
["Woodruff County, AR","99904"]
["Woods County, OK","99937"]
["Woodson County, KS","99917"]
["Woodward County, OK","99937"]
["Worcester County, MA","49340"]
["Worcester County, MD","41540"]
["Worth County, GA","10500"]
["Worth County, IA","99916"]
["Worth County, MO","99926"]
["Wrangell City And Borough, AK","99902"]
["Wright County, IA","99916"]
["Wright County, MN","33460"]
["Wright County, MO","99926"]
["Wyandot County, OH","99936"]
["Wyandotte County, KS","28140"]
["Wyoming County, NY","99933"]
["Wyoming County, PA","42540"]
["Wyoming County, WV","99951"]
["Wythe County, VA","99949"]
["Yabucoa Municipio, PR","41980"]
["Yadkin County, NC","49180"]
["Yakima County, WA","49420"]
["Yakutat Borough, AK","99902"]
["Yalobusha County, MS","99925"]
["Yamhill County, OR","38900"]
["Yancey County, NC","99934"]
["Yankton County, SD","99943"]
["Yates County, NY","40380"]
["Yauco Municipio, PR","38660"]
["Yavapai County, AZ","39140"]
["Yazoo County, MS","27140"]
["Yell County, AR","99904"]
["Yellow Medcine County, MN","99924"]
["Yellowstone County, MT","13740"]
["Yoakum County, TX","99945"]
["Yolo County, CA","40900"]
["York County, ME","38860"]
["York County, NE","99928"]
["York County, PA","49620"]
["York County, SC","16740"]
["York County, VA","47260"]
["Young County, TX","99945"]
["Yuba County, CA","49700"]
["Yukon-Koyukuk Borough, AK","99902"]
["Yuma County, AZ","49740"]
["Yuma County, CO","99906"]
["Zapata County, TX","99945"]
["Zavala County, TX","99945"]
["Ziebach County, SD","99943"]

{"sheet":"Data - Wage Indexes","index":19,"n_rows":3222,"n_cols":10,"rows_kept":3222,"cut":false,"hidden":true,"merged":[]}
["County, State","Wage Index","CBSA Codes","CBSA Name",null,"State","County",null,null,{"$f":"IF(COUNTA(J3:J17)=1,J3&\", \"&I3,\"Select a county\")","v":"Select a county"}]
["Autauga, AL",0.76319999999999999,"33860","Montgomery, AL",null,"AL","Autauga",null,"State","County"]
["Baldwin, AL",0.71609999999999996,"19300","Daphne-Fairhope-Foley, AL",null,"AL","Baldwin",null,"SC","Calhoun"]
["Barbour, AL",0.6724,"99901","Alabama",null,"AL","Barbour",null,null,"Cherokee"]
["Bibb, AL",0.81469999999999998,"13820","Birmingham-Hoover, AL",null,"AL","Bibb",null,null,"Lee"]
["Blount, AL",0.81469999999999998,"13820","Birmingham-Hoover, AL",null,"AL","Blount",null,null,"Marion"]
["Bullock, AL",0.6724,"99901","Alabama",null,"AL","Bullock",null,null,"Pickens"]
["Butler, AL",0.6724,"99901","Alabama",null,"AL","Butler",null,null,"Sumter"]
["Calhoun, AL",0.71899999999999997,"11500","Anniston-Oxford, AL",null,"AL","Calhoun",null,null,"Union"]
["Chambers, AL",0.6724,"99901","Alabama",null,"AL","Chambers",null,null,"Fairfield"]
["Cherokee, AL",0.6724,"99901","Alabama",null,"AL","Cherokee",null,null,"Jasper"]
["Chilton, AL",0.81469999999999998,"13820","Birmingham-Hoover, AL",null,"AL","Chilton",null,null,"Laurens"]
["Choctaw, AL",0.6724,"99901","Alabama",null,"AL","Choctaw",null,null,"Oconee"]
["Clarke, AL",0.6724,"99901","Alabama",null,"AL","Clarke",null,null,"Richland"]
["Clay, AL",0.6724,"99901","Alabama",null,"AL","Clay",null,null,"Anderson"]
["Cleburne, AL",0.6724,"99901","Alabama",null,"AL","Cleburne",null,null,"Greenwood"]
["Coffee, AL",0.6724,"99901","Alabama",null,"AL","Coffee",null,null,"York"]
["Colbert, AL",0.64129999999999998,"22520","Florence-Muscle Shoals, AL",null,"AL","Colbert",null,null,"Dorchester"]
["Conecuh, AL",0.6724,"99901","Alabama",null,"AL","Conecuh",null,null,"Lancaster"]
["Coosa, AL",0.6724,"99901","Alabama",null,"AL","Coosa",null,null,"Beaufort"]
["Covington, AL",0.6724,"99901","Alabama",null,"AL","Covington",null,null,"Chester"]
["Crenshaw, AL",0.6724,"99901","Alabama",null,"AL","Crenshaw",null,null,"Abbeville"]
["Cullman, AL",0.6724,"99901","Alabama",null,"AL","Cullman",null,null,"Aiken"]
["Dale, AL",0.6724,"99901","Alabama",null,"AL","Dale",null,null,"Allendale"]
["Dallas, AL",0.6724,"99901","Alabama",null,"AL","Dallas",null,null,"Bamberg"]
["De Kalb, AL",0.6724,"99901","Alabama",null,"AL","De Kalb",null,null,"Barnwell"]
["Elmore, AL",0.76319999999999999,"33860","Montgomery, AL",null,"AL","Elmore",null,null,"Berkeley"]
["Escambia, AL",0.6724,"99901","Alabama",null,"AL","Escambia",null,null,"Charleston"]
["Etowah, AL",0.67820000000000003,"23460","Gadsden, AL",null,"AL","Etowah",null,null,"Chesterfield"]
["Fayette, AL",0.6724,"99901","Alabama",null,"AL","Fayette",null,null,"Clarendon"]
["Franklin, AL",0.6724,"99901","Alabama",null,"AL","Franklin",null,null,"Colleton"]
["Geneva, AL",0.67989999999999995,"20020","Dothan, AL",null,"AL","Geneva",null,null,"Darlington"]
["Greene, AL",0.72740000000000005,"46220","Tuscaloosa, AL",null,"AL","Greene",null,null,"Dillon"]
["Hale, AL",0.73440000000000005,"46220","Tuscaloosa, AL",null,"AL","Hale",null,null,"Edgefield"]
["Henry, AL",0.67989999999999995,"20020","Dothan, AL",null,"AL","Henry",null,null,"Florence"]
["Houston, AL",0.67989999999999995,"20020","Dothan, AL",null,"AL","Houston",null,null,"Georgetown"]
["Jackson, AL",0.6724,"99901","Alabama",null,"AL","Jackson",null,null,"Greenville"]
["Jefferson, AL",0.81469999999999998,"13820","Birmingham-Hoover, AL",null,"AL","Jefferson",null,null,"Hampton"]
["Lamar, AL",0.6724,"99901","Alabama",null,"AL","Lamar",null,null,"Horry"]
["Lauderdale, AL",0.64129999999999998,"22520","Florence-Muscle Shoals, AL",null,"AL","Lauderdale",null,null,"Kershaw"]
["Lawrence, AL",0.68589999999999995,"19460","Decatur, AL",null,"AL","Lawrence",null,null,"Lexington"]
["Lee, AL",0.6996,"12220","Auburn-Opelika, AL",null,"AL","Lee",null,null,"Mccormick"]
["Limestone, AL",0.8175,"26620","Huntsville, AL",null,"AL","Limestone",null,null,"Marlboro"]
["Lowndes, AL",0.76319999999999999,"33860","Montgomery, AL",null,"AL","Lowndes",null,null,"Newberry"]
["Macon, AL",0.6724,"99901","Alabama",null,"AL","Macon",null,null,"Orangeburg"]
["Madison, AL",0.8175,"26620","Huntsville, AL",null,"AL","Madison",null,null,"Saluda"]
["Marengo, AL",0.6724,"99901","Alabama",null,"AL","Marengo",null,null,"Spartanburg"]
["Marion, AL",0.6724,"99901","Alabama",null,"AL","Marion",null,null,"Williamsburg"]
["Marshall, AL",0.6724,"99901","Alabama",null,"AL","Marshall",null,"LA","Franklin"]
["Mobile, AL",0.74180000000000001,"33660","Mobile, AL",null,"AL","Mobile",null,null,"Jackson"]
["Monroe, AL",0.6724,"99901","Alabama",null,"AL","Monroe",null,null,"Jefferson"]
["Montgomery, AL",0.76319999999999999,"33860","Montgomery, AL",null,"AL","Montgomery",null,null,"Madison"]
["Morgan, AL",0.68589999999999995,"19460","Decatur, AL",null,"AL","Morgan",null,null,"Washington"]
["Perry, AL",0.6724,"99901","Alabama",null,"AL","Perry",null,null,"Grant"]
["Pickens, AL",0.73440000000000005,"46220","Tuscaloosa, AL",null,"AL","Pickens",null,null,"Lafayette"]
["Pike, AL",0.6724,"99901","Alabama",null,"AL","Pike",null,null,"Lincoln"]
["Randolph, AL",0.6724,"99901","Alabama",null,"AL","Randolph",null,null,"Ouachita"]
["Russell, AL",0.78659999999999997,"17980","Columbus, GA-AL",null,"AL","Russell",null,null,"Union"]
["St. Clair, AL",0.81469999999999998,"13820","Birmingham-Hoover, AL",null,"AL","St. Clair",null,null,"De Soto"]
["Shelby, AL",0.81469999999999998,"13820","Birmingham-Hoover, AL",null,"AL","Shelby",null,null,"Webster"]
["Sumter, AL",0.6724,"99901","Alabama",null,"AL","Sumter",null,null,"Livingston"]
["Talladega, AL",0.6724,"99901","Alabama",null,"AL","Talladega",null,null,"Richland"]
["Tallapoosa, AL",0.6724,"99901","Alabama",null,"AL","Tallapoosa",null,null,"Vermilion"]
["Tuscaloosa, AL",0.73440000000000005,"46220","Tuscaloosa, AL",null,"AL","Tuscaloosa",null,null,"Allen"]
["Walker, AL",0.74399999999999999,"99901","Alabama",null,"AL","Walker",null,null,"Caldwell"]
["Washington, AL",0.74180000000000001,"33660","Mobile, AL",null,"AL","Washington",null,null,"Acadia"]
["Wilcox, AL",0.6724,"99901","Alabama",null,"AL","Wilcox",null,null,"Ascension"]
["Winston, AL",0.6724,"99901","Alabama",null,"AL","Winston",null,null,"Assumption"]
["Aleutians East, AK",1.2496,"99902","Alaska",null,"AK","Aleutians East",null,null,"Avoyelles"]
["Aleutians West, AK",1.2496,"99902","Alaska",null,"AK","Aleutians West",null,null,"Beauregard"]
["Anchorage, AK",1.2194,"11260","Anchorage, AK",null,"AK","Anchorage",null,null,"Bienville"]
["Bethel, AK",1.2496,"99902","Alaska",null,"AK","Bethel",null,null,"Bossier"]
["Bristol Bay Borough, AK",1.2496,"99902","Alaska",null,"AK","Bristol Bay Borough",null,null,"Caddo"]
["Denali, AK",1.2496,"99902","Alaska",null,"AK","Denali",null,null,"Calcasieu"]
["Dillingham, AK",1.2496,"99902","Alaska",null,"AK","Dillingham",null,null,"Cameron"]
["Fairbanks North Star, AK",1.0384,"21820","Fairbanks, AK",null,"AK","Fairbanks North Star",null,null,"Catahoula"]
["Haines, AK",1.2496,"99902","Alaska",null,"AK","Haines",null,null,"Claiborne"]
["Hoonah-Angoon Census Area, AK",1.2496,"99902","Alaska",null,"AK","Hoonah-Angoon Census Area",null,null,"Concordia"]
["Juneau, AK",1.2496,"99902","Alaska",null,"AK","Juneau",null,null,"E. Baton Rouge"]
["Kenai Peninsula, AK",1.2496,"99902","Alaska",null,"AK","Kenai Peninsula",null,null,"East Carroll"]
["Ketchikan Gateway, AK",1.2496,"99902","Alaska",null,"AK","Ketchikan Gateway",null,null,"East Feliciana"]
["Kodiak Island Borough, AK",1.2496,"99902","Alaska",null,"AK","Kodiak Island Borough",null,null,"Evangeline"]
["Lake And Peninsula, AK",1.2496,"99902","Alaska",null,"AK","Lake And Peninsula",null,null,"Iberia"]
["Matanuska-Susitna, AK",1.2194,"11260","Anchorage, AK",null,"AK","Matanuska-Susitna",null,null,"Iberville"]
["Nome, AK",1.2496,"99902","Alaska",null,"AK","Nome",null,null,"Jeffrson Davis"]
["North Slope Borouh, AK",1.2496,"99902","Alaska",null,"AK","North Slope Borouh",null,null,"Lafourche"]
["Northwest Artic Borough, AK",1.2496,"99902","Alaska",null,"AK","Northwest Artic Borough",null,null,"Lasalle"]
["Petersburg Borough, AK",1.2496,"99902","Alaska",null,"AK","Petersburg Borough",null,null,"Morehouse"]
["Pr.Of Wales-Hyder Cns Are, AK",1.2496,"99902","Alaska",null,"AK","Pr.Of Wales-Hyder Cns Are",null,null,"Natchitoches"]
["Sitka Borough, AK",1.2496,"99902","Alaska",null,"AK","Sitka Borough",null,null,"Orleans"]
["Skagway-Yakutat, AK",1.2496,"99902","Alaska",null,"AK","Skagway-Yakutat",null,null,"Plaquemines"]
["Southeast Fairbanks, AK",1.2496,"99902","Alaska",null,"AK","Southeast Fairbanks",null,null,"Pointe Coupee"]
["Valdez-Cordova, AK",1.2496,"99902","Alaska",null,"AK","Valdez-Cordova",null,null,"Rapides"]
["Kusilvak Census Area, AK",1.2496,"99902","Alaska",null,"AK","Kusilvak Census Area",null,null,"Red River"]
["Wrangell City And Borough, AK",1.2496,"99902","Alaska",null,"AK","Wrangell City And Borough",null,null,"Sabine"]
["Yakutat Borough, AK",1.2496,"99902","Alaska",null,"AK","Yakutat Borough",null,null,"St. Bernard"]
["Yukon-Koyukuk, AK",1.2496,"99902","Alaska",null,"AK","Yukon-Koyukuk",null,null,"St. Charles"]
["Apache, AZ",0.87560000000000004,"99903","Arizona",null,"AZ","Apache",null,null,"St. Helena"]
["Cochise, AZ",0.79710000000000003,"43420","Sierra Vista-Douglas, AZ",null,"AZ","Cochise",null,null,"St. James"]
["Coconino, AZ",1.0457000000000001,"22380","Flagstaff, AZ",null,"AZ","Coconino",null,null,"St. John Baptist"]
["Gila, AZ",0.87560000000000004,"99903","Arizona",null,"AZ","Gila",null,null,"St. Landry"]
["Graham, AZ",0.87560000000000004,"99903","Arizona",null,"AZ","Graham",null,null,"St. Martin"]
["Greenlee, AZ",0.87560000000000004,"99903","Arizona",null,"AZ","Greenlee",null,null,"St. Mary"]
["Lapaz, AZ",0.87560000000000004,"99903","Arizona",null,"AZ","Lapaz",null,null,"St. Tammany"]
["Maricopa, AZ",0.97389999999999999,"38060","Phoenix-Mesa-Chandler, AZ",null,"AZ","Maricopa",null,null,"Tangipahoa"]
["Mohave, AZ",0.93930000000000002,"29420","Lake Havasu City-Kingman, AZ",null,"AZ","Mohave",null,null,"Tensas"]
["Navajo, AZ",0.87560000000000004,"99903","Arizona",null,"AZ","Navajo",null,null,"Terrebonne"]
["Pima, AZ",0.86439999999999995,"46060","Tucson, AZ",null,"AZ","Pima",null,null,"Vernon"]
["Pinal, AZ",0.97389999999999999,"38060","Phoenix-Mesa-Chandler, AZ",null,"AZ","Pinal",null,null,"W. Baton Rouge"]
["Santa Cruz, AZ",0.87560000000000004,"99903","Arizona",null,"AZ","Santa Cruz",null,null,"West Carroll"]
["Yavapai, AZ",0.99929999999999997,"39150","Prescott Valley-Prescott, AZ",null,"AZ","Yavapai",null,null,"West Feliciana"]
["Yuma, AZ",1.0018,"49740","Yuma, AZ",null,"AZ","Yuma",null,null,"Winn"]
["Arkansas, AR",0.71020000000000005,"99904","Arkansas",null,"AR","Arkansas",null,"VA","Clarke"]
["Ashley, AR",0.71020000000000005,"99904","Arkansas",null,"AR","Ashley",null,null,"Franklin"]
["Baxter, AR",0.71020000000000005,"99904","Arkansas",null,"AR","Baxter",null,null,"Greene"]
["Benton, AR",0.84050000000000002,"22220","Fayetteville-Springdale-Rogers, AR",null,"AR","Benton",null,null,"Henry"]
["Boone, AR",0.71020000000000005,"99904","Arkansas",null,"AR","Boone",null,null,"Lee"]
["Bradley, AR",0.71020000000000005,"99904","Arkansas",null,"AR","Bradley",null,null,"Madison"]
["Calhoun, AR",0.71020000000000005,"99904","Arkansas",null,"AR","Calhoun",null,null,"Montgomery"]
["Carroll, AR",0.71020000000000005,"99904","Arkansas",null,"AR","Carroll",null,null,"Russell"]
["Chicot, AR",0.71020000000000005,"99904","Arkansas",null,"AR","Chicot",null,null,"Washington"]
["Clark, AR",0.71020000000000005,"99904","Arkansas",null,"AR","Clark",null,null,"Carroll"]
["Clay, AR",0.71020000000000005,"99904","Arkansas",null,"AR","Clay",null,null,"Pulaski"]
["Cleburne, AR",0.71020000000000005,"99904","Arkansas",null,"AR","Cleburne",null,null,"Scott"]
["Cleveland, AR",0.77400000000000002,"38220","Pine Bluff, AR",null,"AR","Cleveland",null,null,"Orange"]
["Columbia, AR",0.71020000000000005,"99904","Arkansas",null,"AR","Columbia",null,null,"Middlesex"]
["Conway, AR",0.71020000000000005,"99904","Arkansas",null,"AR","Conway",null,null,"Sussex"]
["Craighead, AR",0.79769999999999996,"27860","Jonesboro, AR",null,"AR","Craighead",null,null,"Charlotte"]
["Crawford, AR",0.82750000000000001,"22900","Fort Smith, AR-OK",null,"AR","Crawford",null,null,"Floyd"]
["Crittenden, AR",0.86699999999999999,"32820","Memphis, TN-MS-AR",null,"AR","Crittenden",null,null,"Richmond"]
["Cross, AR",0.71020000000000005,"99904","Arkansas",null,"AR","Cross",null,null,"Warren"]
["Dallas, AR",0.71020000000000005,"99904","Arkansas",null,"AR","Dallas",null,null,"Cumberland"]
["Desha, AR",0.71020000000000005,"99904","Arkansas",null,"AR","Desha",null,null,"Tazewell"]
["Drew, AR",0.71020000000000005,"99904","Arkansas",null,"AR","Drew",null,null,"Buchanan"]
["Faulkner, AR",0.82879999999999998,"30780","Little Rock-North Little Rock-Conway, AR",null,"AR","Faulkner",null,null,"Louisa"]
["Franklin, AR",0.82750000000000001,"22900","Fort Smith, AR-OK",null,"AR","Franklin",null,null,"Page"]
["Fulton, AR",0.71020000000000005,"99904","Arkansas",null,"AR","Fulton",null,null,"Stafford"]
["Garland, AR",0.81969999999999998,"26300","Hot Springs, AR",null,"AR","Garland",null,null,"Bath"]
["Grant, AR",0.82879999999999998,"30780","Little Rock-North Little Rock-Conway, AR",null,"AR","Grant",null,null,"Campbell"]
["Greene, AR",0.71020000000000005,"99904","Arkansas",null,"AR","Greene",null,null,"Grayson"]
["Hempstead, AR",0.71020000000000005,"99904","Arkansas",null,"AR","Hempstead",null,null,"Nelson"]
["Hot Spring, AR",0.71020000000000005,"99904","Arkansas",null,"AR","Hot Spring",null,null,"York"]
["Howard, AR",0.71020000000000005,"99904","Arkansas",null,"AR","Howard",null,null,"Caroline"]
["Independence, AR",0.71020000000000005,"99904","Arkansas",null,"AR","Independence",null,null,"Frederick"]
["Izard, AR",0.71020000000000005,"99904","Arkansas",null,"AR","Izard",null,null,"Essex"]
["Jackson, AR",0.71020000000000005,"99904","Arkansas",null,"AR","Jackson",null,null,"Lancaster"]
["Jefferson, AR",0.77400000000000002,"38220","Pine Bluff, AR",null,"AR","Jefferson",null,null,"Rockingham"]
["Johnson, AR",0.71020000000000005,"99904","Arkansas",null,"AR","Johnson",null,null,"Gloucester"]
["Lafayette, AR",0.71020000000000005,"99904","Arkansas",null,"AR","Lafayette",null,null,"Alleghany"]
["Lawrence, AR",0.71020000000000005,"99904","Arkansas",null,"AR","Lawrence",null,null,"Brunswick"]
["Lee, AR",0.71020000000000005,"99904","Arkansas",null,"AR","Lee",null,null,"Halifax"]
["Lincoln, AR",0.77400000000000002,"38220","Pine Bluff, AR",null,"AR","Lincoln",null,null,"Mecklenburg"]
["Little River, AR",0.85580000000000001,"45500","Texarkana, TX-AR",null,"AR","Little River",null,null,"Northampton"]
["Logan, AR",0.71020000000000005,"99904","Arkansas",null,"AR","Logan",null,null,"Surry"]
["Lonoke, AR",0.82879999999999998,"30780","Little Rock-North Little Rock-Conway, AR",null,"AR","Lonoke",null,null,"Highland"]
["Madison, AR",0.84050000000000002,"22220","Fayetteville-Springdale-Rogers, AR",null,"AR","Madison",null,null,"Craig"]
["Marion, AR",0.71020000000000005,"99904","Arkansas",null,"AR","Marion",null,null,"Bedford"]
["Miller, AR",0.85580000000000001,"45500","Texarkana, TX-AR",null,"AR","Miller",null,null,"Northumberlnd"]
["Mississippi, AR",0.71020000000000005,"99904","Arkansas",null,"AR","Mississippi",null,null,"Westmoreland"]
["Monroe, AR",0.71020000000000005,"99904","Arkansas",null,"AR","Monroe",null,null,"Chesterfield"]
["Montgomery, AR",0.71020000000000005,"99904","Arkansas",null,"AR","Montgomery",null,null,"Giles"]
["Nevada, AR",0.71020000000000005,"99904","Arkansas",null,"AR","Nevada",null,null,"Wise"]
["Newton, AR",0.71020000000000005,"99904","Arkansas",null,"AR","Newton",null,null,"Accomack"]
["Ouachita, AR",0.71020000000000005,"99904","Arkansas",null,"AR","Ouachita",null,null,"Albemarle"]
["Perry, AR",0.82879999999999998,"30780","Little Rock-North Little Rock-Conway, AR",null,"AR","Perry",null,null,"Alexandria City"]
["Phillips, AR",0.71020000000000005,"99904","Arkansas",null,"AR","Phillips",null,null,"Amelia"]
["Pike, AR",0.71020000000000005,"99904","Arkansas",null,"AR","Pike",null,null,"Amherst"]
["Poinsett, AR",0.79769999999999996,"27860","Jonesboro, AR",null,"AR","Poinsett",null,null,"Appomattox"]
["Polk, AR",0.71020000000000005,"99904","Arkansas",null,"AR","Polk",null,null,"Arlington"]
["Pope, AR",0.71020000000000005,"99904","Arkansas",null,"AR","Pope",null,null,"Augusta"]
["Prairie, AR",0.71020000000000005,"99904","Arkansas",null,"AR","Prairie",null,null,"Bland"]
["Pulaski, AR",0.82879999999999998,"30780","Little Rock-North Little Rock-Conway, AR",null,"AR","Pulaski",null,null,"Botetourt"]
["Randolph, AR",0.71020000000000005,"99904","Arkansas",null,"AR","Randolph",null,null,"Bristol City"]
["St. Francis, AR",0.71020000000000005,"99904","Arkansas",null,"AR","St. Francis",null,null,"Buckingham"]
["Saline, AR",0.82879999999999998,"30780","Little Rock-North Little Rock-Conway, AR",null,"AR","Saline",null,null,"Buena Vista City"]
["Scott, AR",0.71020000000000005,"99904","Arkansas",null,"AR","Scott",null,null,"Charles City"]
["Searcy, AR",0.71020000000000005,"99904","Arkansas",null,"AR","Searcy",null,null,"Charlottesville City"]
["Sebastian, AR",0.82750000000000001,"22900","Fort Smith, AR-OK",null,"AR","Sebastian",null,null,"Chesapeake City"]
["Sevier, AR",0.71020000000000005,"99904","Arkansas",null,"AR","Sevier",null,null,"Colonial Heights City"]
["Sharp, AR",0.71020000000000005,"99904","Arkansas",null,"AR","Sharp",null,null,"Covington City"]
["Stone, AR",0.71020000000000005,"99904","Arkansas",null,"AR","Stone",null,null,"Culpeper"]
["Union, AR",0.71020000000000005,"99904","Arkansas",null,"AR","Union",null,null,"Danville City"]
["Van Buren, AR",0.71020000000000005,"99904","Arkansas",null,"AR","Van Buren",null,null,"Dickenson"]
["Washington, AR",0.84050000000000002,"22220","Fayetteville-Springdale-Rogers, AR",null,"AR","Washington",null,null,"Dinwiddie"]
["White, AR",0.71020000000000005,"99904","Arkansas",null,"AR","White",null,null,"Emporia City"]
["Woodruff, AR",0.71020000000000005,"99904","Arkansas",null,"AR","Woodruff",null,null,"Fairfax City"]
["Yell, AR",0.71020000000000005,"99904","Arkansas",null,"AR","Yell",null,null,"Fairfax"]
["Alameda, CA",1.7935000000000001,"36084","Oakland-Berkeley-Livermore, CA",null,"CA","Alameda",null,null,"Falls Church City"]
["Alpine, CA",1.3052999999999999,"99905","California",null,"CA","Alpine",null,null,"Fauquier"]
["Amador, CA",1.3052999999999999,"99905","California",null,"CA","Amador",null,null,"Fluvanna"]
["Butte, CA",1.1109,"17020","Chico, CA",null,"CA","Butte",null,null,"Franklin City"]
["Calaveras, CA",1.3052999999999999,"99905","California",null,"CA","Calaveras",null,null,"Fredericksburg City"]
["Colusa, CA",1.3052999999999999,"99905","California",null,"CA","Colusa",null,null,"Galax City"]
["Contra Costa, CA",1.7935000000000001,"36084","Oakland-Berkeley-Livermore, CA",null,"CA","Contra Costa",null,null,"Goochland"]
["Del Norte, CA",1.3052999999999999,"99905","California",null,"CA","Del Norte",null,null,"Greensville"]
["El Dorado, CA",1.6922999999999999,"40900","Sacramento-Roseville-Folsom, CA",null,"CA","El Dorado",null,null,"Hampton City"]
["Fresno, CA",1.091,"23420","Fresno, CA",null,"CA","Fresno",null,null,"Hanover"]
["Glenn, CA",1.3052999999999999,"99905","California",null,"CA","Glenn",null,null,"Harrisonburg City"]
["Humboldt, CA",1.3052999999999999,"99905","California",null,"CA","Humboldt",null,null,"Henrico"]
["Imperial, CA",0.90849999999999997,"20940","El Centro, CA",null,"CA","Imperial",null,null,"Hopewell City"]
["Inyo, CA",1.3052999999999999,"99905","California",null,"CA","Inyo",null,null,"Isle Of Wight"]
["Kern, CA",1.2090000000000001,"12540","Bakersfield, CA",null,"CA","Kern",null,null,"James City"]
["Kings, CA",1.0837000000000001,"25260","Hanford-Corcoran, CA",null,"CA","Kings",null,null,"King And Queen"]
["Lake, CA",1.3052999999999999,"99905","California",null,"CA","Lake",null,null,"King George"]
["Lassen, CA",1.3052999999999999,"99905","California",null,"CA","Lassen",null,null,"King William"]
["Los Angeles, CA",1.3121,"31084","Los Angeles-Long Beach-Glendale, CA",null,"CA","Los Angeles",null,null,"Lexington City"]
["Los Angeles, CA",1.3121,"31084","Los Angeles-Long Beach-Glendale, CA",null,"CA","Los Angeles",null,null,"Loudoun"]
["Madera, CA",0.73009999999999997,"31460","Madera, CA",null,"CA","Madera",null,null,"Lunenburg"]
["Marin, CA",1.8259000000000001,"42034","San Rafael, CA",null,"CA","Marin",null,null,"Lynchburg City"]
["Mariposa, CA",1.3052999999999999,"99905","California",null,"CA","Mariposa",null,null,"Martinsville City"]
["Mendocino, CA",1.3052999999999999,"99905","California",null,"CA","Mendocino",null,null,"Manassas City"]
["Merced, CA",1.3466,"32900","Merced, CA",null,"CA","Merced",null,null,"Manassas Park City"]
["Modoc, CA",1.3052999999999999,"99905","California",null,"CA","Modoc",null,null,"Mathews"]
["Mono, CA",1.3052999999999999,"99905","California",null,"CA","Mono",null,null,"New Kent"]
["Monterey, CA",1.7927999999999999,"41500","Salinas, CA",null,"CA","Monterey",null,null,"Newport News City"]
["Napa, CA",1.5841000000000001,"34900","Napa, CA",null,"CA","Napa",null,null,"Norfolk City"]
["Nevada, CA",1.3052999999999999,"99905","California",null,"CA","Nevada",null,null,"Norton City"]
["Orange, CA",1.2608999999999999,"11244","Anaheim-Santa Ana-Irvine, CA",null,"CA","Orange",null,null,"Nottoway"]
["Placer, CA",1.6922999999999999,"40900","Sacramento-Roseville-Folsom, CA",null,"CA","Placer",null,null,"Patrick"]
["Plumas, CA",1.3052999999999999,"99905","California",null,"CA","Plumas",null,null,"Petersburg City"]
["Riverside, CA",1.2048000000000001,"40140","Riverside-San Bernardino-Ontario, CA",null,"CA","Riverside",null,null,"Pittsylvania"]
["Sacramento, CA",1.6922999999999999,"40900","Sacramento-Roseville-Folsom, CA",null,"CA","Sacramento",null,null,"Portsmouth City"]
["San Benito, CA",1.8573,"41940","San Jose-Sunnyvale-Santa Clara, CA",null,"CA","San Benito",null,null,"Poquoson"]
["San Bernardino, CA",1.2048000000000001,"40140","Riverside-San Bernardino-Ontario, CA",null,"CA","San Bernardino",null,null,"Powhatan"]
["San Diego, CA",1.2737000000000001,"41740","San Diego-Chula Vista-Carlsbad, CA",null,"CA","San Diego",null,null,"Prince Edward"]
["San Francisco, CA",1.8661000000000001,"41884","San Francisco-San Mateo-Redwood City, CA",null,"CA","San Francisco",null,null,"Prince George"]
["San Joaquin, CA",1.5313000000000001,"44700","Stockton, CA",null,"CA","San Joaquin",null,null,"Prince William"]
["San Luis Obispo, CA",1.3689,"42020","San Luis Obispo-Paso Robles, CA",null,"CA","San Luis Obispo",null,null,"Radford City"]
["San Mateo, CA",1.8661000000000001,"41884","San Francisco-San Mateo-Redwood City, CA",null,"CA","San Mateo",null,null,"Rappahannock"]
["Santa Barbara, CA",1.4354,"42200","Santa Maria-Santa Barbara, CA",null,"CA","Santa Barbara",null,null,"Richmond City"]
["Santa Clara, CA",1.8573,"41940","San Jose-Sunnyvale-Santa Clara, CA",null,"CA","Santa Clara",null,null,"Roanoke"]
["Santa Cruz, CA",1.8807,"42100","Santa Cruz-Watsonville, CA",null,"CA","Santa Cruz",null,null,"Roanoke City"]
["Shasta, CA",1.4011,"39820","Redding, CA",null,"CA","Shasta",null,null,"Rockbridge"]
["Sierra, CA",1.3052999999999999,"99905","California",null,"CA","Sierra",null,null,"Salem City"]
["Siskiyou, CA",1.3052999999999999,"99905","California",null,"CA","Siskiyou",null,null,"Shenandoah"]
["Solano, CA",1.7961,"46700","Vallejo, CA",null,"CA","Solano",null,null,"Smyth"]
["Sonoma, CA",1.7091000000000001,"42220","Santa Rosa-Petaluma, CA",null,"CA","Sonoma",null,null,"Southampton"]
["Stanislaus, CA",1.3394999999999999,"33700","Modesto, CA",null,"CA","Stanislaus",null,null,"Spotsylvania"]
["Sutter, CA",1.3516999999999999,"49700","Yuba City, CA",null,"CA","Sutter",null,null,"Staunton City"]
["Tehama, CA",1.3052999999999999,"99905","California",null,"CA","Tehama",null,null,"Suffolk City"]
["Trinity, CA",1.3052999999999999,"99905","California",null,"CA","Trinity",null,null,"Virginia Beach City"]
["Tulare, CA",0.92779999999999996,"47300","Visalia, CA",null,"CA","Tulare",null,null,"Waynesboro City"]
["Tuolumne, CA",1.3052999999999999,"99905","California",null,"CA","Tuolumne",null,null,"Williamsburg City"]
["Ventura, CA",1.3349,"37100","Oxnard-Thousand Oaks-Ventura, CA",null,"CA","Ventura",null,null,"Winchester City"]
["Yolo, CA",1.6922999999999999,"40900","Sacramento-Roseville-Folsom, CA",null,"CA","Yolo",null,null,"Wythe"]
["Yuba, CA",1.3516999999999999,"49700","Yuba City, CA",null,"CA","Yuba",null,"ID","Elmore"]
["Adams, CO",1.002,"19740","Denver-Aurora-Lakewood, CO",null,"CO","Adams",null,null,"Franklin"]
["Alamosa, CO",1.0085999999999999,"99906","Colorado",null,"CO","Alamosa",null,null,"Jefferson"]
["Arapahoe, CO",1.002,"19740","Denver-Aurora-Lakewood, CO",null,"CO","Arapahoe",null,null,"Madison"]
["Archuleta, CO",1.0085999999999999,"99906","Colorado",null,"CO","Archuleta",null,null,"Washington"]
["Baca, CO",1.0085999999999999,"99906","Colorado",null,"CO","Baca",null,null,"Clark"]
["Bent, CO",1.0085999999999999,"99906","Colorado",null,"CO","Bent",null,null,"Lincoln"]
["Boulder, CO",1.0573999999999999,"14500","Boulder, CO",null,"CO","Boulder",null,null,"Butte"]
["Chaffee, CO",1.0085999999999999,"99906","Colorado",null,"CO","Chaffee",null,null,"Adams"]
["Cheyenne, CO",1.0085999999999999,"99906","Colorado",null,"CO","Cheyenne",null,null,"Custer"]
["Clear Creek, CO",1.002,"19740","Denver-Aurora-Lakewood, CO",null,"CO","Clear Creek",null,null,"Fremont"]
["Conejos, CO",1.0085999999999999,"99906","Colorado",null,"CO","Conejos",null,null,"Ada"]
["Costilla, CO",1.0085999999999999,"99906","Colorado",null,"CO","Costilla",null,null,"Bannock"]
["Crowley, CO",1.0085999999999999,"99906","Colorado",null,"CO","Crowley",null,null,"Bear Lake"]
["Custer, CO",1.0085999999999999,"99906","Colorado",null,"CO","Custer",null,null,"Benewah"]
["Delta, CO",1.0085999999999999,"99906","Colorado",null,"CO","Delta",null,null,"Bingham"]
["Denver, CO",1.002,"19740","Denver-Aurora-Lakewood, CO",null,"CO","Denver",null,null,"Blaine"]
["Dolores, CO",1.0085999999999999,"99906","Colorado",null,"CO","Dolores",null,null,"Boise"]
["Douglas, CO",1.002,"19740","Denver-Aurora-Lakewood, CO",null,"CO","Douglas",null,null,"Bonner"]
["Eagle, CO",1.0085999999999999,"99906","Colorado",null,"CO","Eagle",null,null,"Bonneville"]
["Elbert, CO",1.002,"19740","Denver-Aurora-Lakewood, CO",null,"CO","Elbert",null,null,"Boundary"]
["El Paso, CO",0.96509999999999996,"17820","Colorado Springs, CO",null,"CO","El Paso",null,null,"Camas"]
["Fremont, CO",1.0085999999999999,"99906","Colorado",null,"CO","Fremont",null,null,"Canyon"]
["Garfield, CO",1.0085999999999999,"99906","Colorado",null,"CO","Garfield",null,null,"Caribou"]
["Gilpin, CO",1.002,"19740","Denver-Aurora-Lakewood, CO",null,"CO","Gilpin",null,null,"Cassia"]
["Grand, CO",1.0085999999999999,"99906","Colorado",null,"CO","Grand",null,null,"Clearwater"]
["Gunnison, CO",1.0085999999999999,"99906","Colorado",null,"CO","Gunnison",null,null,"Gem"]
["Hinsdale, CO",1.0085999999999999,"99906","Colorado",null,"CO","Hinsdale",null,null,"Gooding"]
["Huerfano, CO",1.0085999999999999,"99906","Colorado",null,"CO","Huerfano",null,null,"Idaho"]
["Jackson, CO",1.0085999999999999,"99906","Colorado",null,"CO","Jackson",null,null,"Jerome"]
["Jefferson, CO",1.002,"19740","Denver-Aurora-Lakewood, CO",null,"CO","Jefferson",null,null,"Kootenai"]
["Kiowa, CO",1.0085999999999999,"99906","Colorado",null,"CO","Kiowa",null,null,"Latah"]
["Kit Carson, CO",1.0085999999999999,"99906","Colorado",null,"CO","Kit Carson",null,null,"Lemhi"]
["Lake, CO",1.0085999999999999,"99906","Colorado",null,"CO","Lake",null,null,"Lewis"]
["La Plata, CO",1.0085999999999999,"99906","Colorado",null,"CO","La Plata",null,null,"Minidoka"]
["Larimer, CO",0.97750000000000004,"22660","Fort Collins, CO",null,"CO","Larimer",null,null,"Nez Perce"]
["Las Animas, CO",1.0085999999999999,"99906","Colorado",null,"CO","Las Animas",null,null,"Oneida"]
["Lincoln, CO",1.0085999999999999,"99906","Colorado",null,"CO","Lincoln",null,null,"Owyhee"]
["Logan, CO",1.0085999999999999,"99906","Colorado",null,"CO","Logan",null,null,"Payette"]
["Mesa, CO",0.94810000000000005,"24300","Grand Junction, CO",null,"CO","Mesa",null,null,"Power"]
["Mineral, CO",1.0085999999999999,"99906","Colorado",null,"CO","Mineral",null,null,"Shoshone"]
["Moffat, CO",1.0085999999999999,"99906","Colorado",null,"CO","Moffat",null,null,"Teton"]
["Montezuma, CO",1.0085999999999999,"99906","Colorado",null,"CO","Montezuma",null,null,"Twin Falls"]
["Montrose, CO",1.0085999999999999,"99906","Colorado",null,"CO","Montrose",null,null,"Valley"]
["Morgan, CO",1.0085999999999999,"99906","Colorado",null,"CO","Morgan",null,"IA","Butler"]
["Otero, CO",1.0085999999999999,"99906","Colorado",null,"CO","Otero",null,null,"Calhoun"]
["Ouray, CO",1.0085999999999999,"99906","Colorado",null,"CO","Ouray",null,null,"Cherokee"]
["Park, CO",1.002,"19740","Denver-Aurora-Lakewood, CO",null,"CO","Park",null,null,"Clarke"]
["Phillips, CO",1.0085999999999999,"99906","Colorado",null,"CO","Phillips",null,null,"Clay"]
["Pitkin, CO",1.0085999999999999,"99906","Colorado",null,"CO","Pitkin",null,null,"Dallas"]
["Prowers, CO",1.0085999999999999,"99906","Colorado",null,"CO","Prowers",null,null,"Fayette"]
["Pueblo, CO",0.81310000000000004,"39380","Pueblo, CO",null,"CO","Pueblo",null,null,"Franklin"]
["Rio Blanco, CO",1.0085999999999999,"99906","Colorado",null,"CO","Rio Blanco",null,null,"Greene"]
["Rio Grande, CO",1.0085999999999999,"99906","Colorado",null,"CO","Rio Grande",null,null,"Henry"]
["Routt, CO",1.0085999999999999,"99906","Colorado",null,"CO","Routt",null,null,"Jackson"]
["Saguache, CO",1.0085999999999999,"99906","Colorado",null,"CO","Saguache",null,null,"Jefferson"]
["San Juan, CO",1.0085999999999999,"99906","Colorado",null,"CO","San Juan",null,null,"Lee"]
["San Miguel, CO",1.0085999999999999,"99906","Colorado",null,"CO","San Miguel",null,null,"Madison"]
["Sedgwick, CO",1.0085999999999999,"99906","Colorado",null,"CO","Sedgwick",null,null,"Marion"]
["Summit, CO",1.0085999999999999,"99906","Colorado",null,"CO","Summit",null,null,"Marshall"]
["Teller, CO",0.96509999999999996,"17820","Colorado Springs, CO",null,"CO","Teller",null,null,"Monroe"]
["Washington, CO",1.0085999999999999,"99906","Colorado",null,"CO","Washington",null,null,"Montgomery"]
["Weld, CO",0.8931,"24540","Greeley, CO",null,"CO","Weld",null,null,"Shelby"]
["Yuma, CO",1.0085999999999999,"99906","Colorado",null,"CO","Yuma",null,null,"Washington"]
["Broomfield, CO",1.002,"19740","Denver-Aurora-Lakewood, CO",null,"CO","Broomfield",null,null,"Benton"]
["Fairfield, CT",1.2070000000000001,"14860","Bridgeport-Stamford-Norwalk, CT",null,"CT","Fairfield",null,null,"Boone"]
["Hartford, CT",1.0716000000000001,"25540","Hartford-East Hartford-Middletown, CT",null,"CT","Hartford",null,null,"Carroll"]
["Litchfield, CT",1.0004,"99907","Connecticut",null,"CT","Litchfield",null,null,"Crawford"]
["Middlesex, CT",1.0716000000000001,"25540","Hartford-East Hartford-Middletown, CT",null,"CT","Middlesex",null,null,"Howard"]
["New Haven, CT",1.1617,"35300","New Haven-Milford, CT",null,"CT","New Haven",null,null,"Johnson"]
["New London, CT",1.1124000000000001,"35980","Norwich-New London, CT",null,"CT","New London",null,null,"Polk"]
["Tolland, CT",1.0716000000000001,"25540","Hartford-East Hartford-Middletown, CT",null,"CT","Tolland",null,null,"Scott"]
["Windham, CT",1.1233,"49340","Worcester, MA-CT",null,"CT","Windham",null,null,"Union"]
["Kent, DE",1.0006999999999999,"20100","Dover, DE",null,"DE","Kent",null,null,"Van Buren"]
["New Castle, DE",1.0928,"48864","Wilmington, DE-MD-NJ",null,"DE","New Castle",null,null,"Humboldt"]
["Sussex, DE",0.92469999999999997,"41540","Salisbury, MD-DE",null,"DE","Sussex",null,null,"Adams"]
["The District, DC",1.0152000000000001,"47894","Washington-Arlington-Alexandria, DC-VA-MD-WV",null,"DC","The District",null,null,"Fremont"]
["Alachua, FL",0.90210000000000001,"23540","Gainesville, FL",null,"FL","Alachua",null,null,"Hamilton"]
["Baker, FL",0.86570000000000003,"27260","Jacksonville, FL",null,"FL","Baker",null,null,"Osceola"]
["Bay, FL",0.82950000000000002,"37460","Panama City, FL",null,"FL","Bay",null,null,"Taylor"]
["Bradford, FL",0.82589999999999997,"99910","Florida",null,"FL","Bradford",null,null,"Clayton"]
["Brevard, FL",0.88070000000000004,"37340","Palm Bay-Melbourne-Titusville, FL",null,"FL","Brevard",null,null,"Decatur"]
["Broward, FL",0.94740000000000002,"22744","Fort Lauderdale-Pompano Beach-Sunrise, FL",null,"FL","Broward",null,null,"Floyd"]
["Calhoun, FL",0.82589999999999997,"99910","Florida",null,"FL","Calhoun",null,null,"Hancock"]
["Charlotte, FL",0.86480000000000001,"39460","Punta Gorda, FL",null,"FL","Charlotte",null,null,"Jasper"]
["Citrus, FL",0.85970000000000002,"26140","Homosassa Springs, FL",null,"FL","Citrus",null,null,"Jones"]
["Clay, FL",0.86570000000000003,"27260","Jacksonville, FL",null,"FL","Clay",null,null,"Mitchell"]
["Collier, FL",0.84819999999999995,"34940","Naples-Marco Island, FL",null,"FL","Collier",null,null,"Warren"]
["Columbia, FL",0.82589999999999997,"99910","Florida",null,"FL","Columbia",null,null,"Wayne"]
["Miami-Dade, FL",0.93899999999999995,"33124","Miami-Miami Beach-Kendall, FL",null,"FL","Miami-Dade",null,null,"Webster"]
["De Soto, FL",0.82589999999999997,"99910","Florida",null,"FL","De Soto",null,null,"Worth"]
["Dixie, FL",0.82589999999999997,"99910","Florida",null,"FL","Dixie",null,null,"Cass"]
["Duval, FL",0.86570000000000003,"27260","Jacksonville, FL",null,"FL","Duval",null,null,"Clinton"]
["Escambia, FL",0.82020000000000004,"37860","Pensacola-Ferry Pass-Brent, FL",null,"FL","Escambia",null,null,"Grundy"]
["Flagler, FL",0.81289999999999996,"19660","Deltona-Daytona Beach-Ormond Beach, FL",null,"FL","Flagler",null,null,"Hardin"]
["Franklin, FL",0.82589999999999997,"99910","Florida",null,"FL","Franklin",null,null,"Winnebago"]
["Gadsden, FL",0.81889999999999996,"45220","Tallahassee, FL",null,"FL","Gadsden",null,null,"Delaware"]
["Gilchrist, FL",0.90210000000000001,"23540","Gainesville, FL",null,"FL","Gilchrist",null,null,"Harrison"]
["Glades, FL",0.82589999999999997,"99910","Florida",null,"FL","Glades",null,null,"Adair"]
["Gulf, FL",0.82589999999999997,"99910","Florida",null,"FL","Gulf",null,null,"Allamakee"]
["Hamilton, FL",0.82589999999999997,"99910","Florida",null,"FL","Hamilton",null,null,"Appanoose"]
["Hardee, FL",0.82589999999999997,"99910","Florida",null,"FL","Hardee",null,null,"Audubon"]
["Hendry, FL",0.82589999999999997,"99910","Florida",null,"FL","Hendry",null,null,"Black Hawk"]
["Hernando, FL",0.89129999999999998,"45300","Tampa-St. Petersburg-Clearwater, FL",null,"FL","Hernando",null,null,"Bremer"]
["Highlands, FL",0.78569999999999995,"42700","Sebring-Avon Park, FL",null,"FL","Highlands",null,null,"Buchanan"]
["Hillsborough, FL",0.89129999999999998,"45300","Tampa-St. Petersburg-Clearwater, FL",null,"FL","Hillsborough",null,null,"Buena Vista"]
["Holmes, FL",0.82589999999999997,"99910","Florida",null,"FL","Holmes",null,null,"Cedar"]
["Indian River, FL",0.7954,"42680","Sebastian-Vero Beach, FL",null,"FL","Indian River",null,null,"Cerro Gordo"]
["Jackson, FL",0.82589999999999997,"99910","Florida",null,"FL","Jackson",null,null,"Chickasaw"]
["Jefferson, FL",0.81889999999999996,"45220","Tallahassee, FL",null,"FL","Jefferson",null,null,"Davis"]
["Lafayette, FL",0.82589999999999997,"99910","Florida",null,"FL","Lafayette",null,null,"Des Moines"]
["Lake, FL",0.87519999999999998,"36740","Orlando-Kissimmee-Sanford, FL",null,"FL","Lake",null,null,"Dickinson"]
["Lee, FL",0.90990000000000004,"15980","Cape Coral-Fort Myers, FL",null,"FL","Lee",null,null,"Dubuque"]
["Leon, FL",0.81889999999999996,"45220","Tallahassee, FL",null,"FL","Leon",null,null,"Emmet"]
["Levy, FL",0.90210000000000001,"23540","Gainesville, FL",null,"FL","Levy",null,null,"Guthrie"]
["Liberty, FL",0.82589999999999997,"99910","Florida",null,"FL","Liberty",null,null,"Ida"]
["Madison, FL",0.82589999999999997,"99910","Florida",null,"FL","Madison",null,null,"Iowa"]
["Manatee, FL",0.92449999999999999,"35840","North Port-Sarasota-Bradenton, FL",null,"FL","Manatee",null,null,"Keokuk"]
["Marion, FL",0.85240000000000005,"36100","Ocala, FL",null,"FL","Marion",null,null,"Kossuth"]
["Martin, FL",0.89790000000000003,"38940","Port St. Lucie, FL",null,"FL","Martin",null,null,"Linn"]
["Monroe, FL",0.82589999999999997,"99910","Florida",null,"FL","Monroe",null,null,"Louisa"]
["Nassau, FL",0.86570000000000003,"27260","Jacksonville, FL",null,"FL","Nassau",null,null,"Lucas"]
["Okaloosa, FL",0.89659999999999995,"18880","Crestview-Fort Walton Beach-Destin, FL",null,"FL","Okaloosa",null,null,"Lyon"]
["Okeechobee, FL",0.82589999999999997,"99910","Florida",null,"FL","Okeechobee",null,null,"Mahaska"]
["Orange, FL",0.87519999999999998,"36740","Orlando-Kissimmee-Sanford, FL",null,"FL","Orange",null,null,"Mills"]
["Osceola, FL",0.87519999999999998,"36740","Orlando-Kissimmee-Sanford, FL",null,"FL","Osceola",null,null,"Monona"]
["Palm Beach, FL",0.90810000000000002,"48424","West Palm Beach-Boca Raton-Boynton Beach, FL",null,"FL","Palm Beach",null,null,"Muscatine"]
["Pasco, FL",0.89129999999999998,"45300","Tampa-St. Petersburg-Clearwater, FL",null,"FL","Pasco",null,null,"Obrien"]
["Pinellas, FL",0.89129999999999998,"45300","Tampa-St. Petersburg-Clearwater, FL",null,"FL","Pinellas",null,null,"Page"]
["Polk, FL",0.79569999999999996,"29460","Lakeland-Winter Haven, FL",null,"FL","Polk",null,null,"Palo Alto"]
["Putnam, FL",0.82589999999999997,"99910","Florida",null,"FL","Putnam",null,null,"Plymouth"]
["St. Johns, FL",0.86570000000000003,"27260","Jacksonville, FL",null,"FL","St. Johns",null,null,"Pocahontas"]
["St. Lucie, FL",0.89790000000000003,"38940","Port St. Lucie, FL",null,"FL","St. Lucie",null,null,"Pottawattamie"]
["Santa Rosa, FL",0.82020000000000004,"37860","Pensacola-Ferry Pass-Brent, FL",null,"FL","Santa Rosa",null,null,"Poweshiek"]
["Sarasota, FL",0.92449999999999999,"35840","North Port-Sarasota-Bradenton, FL",null,"FL","Sarasota",null,null,"Ringgold"]
["Seminole, FL",0.87519999999999998,"36740","Orlando-Kissimmee-Sanford, FL",null,"FL","Seminole",null,null,"Sac"]
["Sumter, FL",0.78879999999999995,"45540","The Villages, FL",null,"FL","Sumter",null,null,"Sioux"]
["Suwannee, FL",0.82589999999999997,"99910","Florida",null,"FL","Suwannee",null,null,"Story"]
["Taylor, FL",0.82589999999999997,"99910","Florida",null,"FL","Taylor",null,null,"Tama"]
["Union, FL",0.82589999999999997,"99910","Florida",null,"FL","Union",null,null,"Wapello"]
["Volusia, FL",0.81289999999999996,"19660","Deltona-Daytona Beach-Ormond Beach, FL",null,"FL","Volusia",null,null,"Winneshiek"]
["Wakulla, FL",0.81889999999999996,"45220","Tallahassee, FL",null,"FL","Wakulla",null,null,"Woodbury"]
["Walton, FL",0.89659999999999995,"18880","Crestview-Fort Walton Beach-Destin, FL",null,"FL","Walton",null,null,"Wright"]
["Washington, FL",0.82589999999999997,"99910","Florida",null,"FL","Washington",null,"KY","Butler"]
["Appling, GA",0.71809999999999996,"99911","Georgia",null,"GA","Appling",null,null,"Clay"]
["Atkinson, GA",0.71809999999999996,"99911","Georgia",null,"GA","Atkinson",null,null,"Fayette"]
["Bacon, GA",0.71809999999999996,"99911","Georgia",null,"GA","Bacon",null,null,"Franklin"]
["Baker, GA",0.76670000000000005,"99911","Georgia",null,"GA","Baker",null,null,"Henry"]
["Baldwin, GA",0.71809999999999996,"99911","Georgia",null,"GA","Baldwin",null,null,"Jackson"]
["Banks, GA",0.71809999999999996,"99911","Georgia",null,"GA","Banks",null,null,"Jefferson"]
["Barrow, GA",0.94630000000000003,"12060","Atlanta-Sandy Springs-Alpharetta, GA",null,"GA","Barrow",null,null,"Lawrence"]
["Bartow, GA",0.94630000000000003,"12060","Atlanta-Sandy Springs-Alpharetta, GA",null,"GA","Bartow",null,null,"Lee"]
["Ben Hill, GA",0.71809999999999996,"99911","Georgia",null,"GA","Ben Hill",null,null,"Madison"]
["Berrien, GA",0.71809999999999996,"99911","Georgia",null,"GA","Berrien",null,null,"Marion"]
["Bibb, GA",0.91359999999999997,"31420","Macon-Bibb County, GA",null,"GA","Bibb",null,null,"Marshall"]
["Bleckley, GA",0.71809999999999996,"99911","Georgia",null,"GA","Bleckley",null,null,"Monroe"]
["Brantley, GA",0.76959999999999995,"15260","Brunswick, GA",null,"GA","Brantley",null,null,"Montgomery"]
["Brooks, GA",0.7248,"46660","Valdosta, GA",null,"GA","Brooks",null,null,"Morgan"]
["Bryan, GA",0.79210000000000003,"42340","Savannah, GA",null,"GA","Bryan",null,null,"Perry"]
["Bulloch, GA",0.71809999999999996,"99911","Georgia",null,"GA","Bulloch",null,null,"Pike"]
["Burke, GA",0.86529999999999996,"12260","Augusta-Richmond County, GA-SC",null,"GA","Burke",null,null,"Russell"]
["Butts, GA",0.94630000000000003,"12060","Atlanta-Sandy Springs-Alpharetta, GA",null,"GA","Butts",null,null,"Shelby"]
["Calhoun, GA",0.71809999999999996,"99911","Georgia",null,"GA","Calhoun",null,null,"Washington"]
["Camden, GA",0.71809999999999996,"99911","Georgia",null,"GA","Camden",null,null,"Boone"]
["Candler, GA",0.71809999999999996,"99911","Georgia",null,"GA","Candler",null,null,"Carroll"]
["Carroll, GA",0.94630000000000003,"12060","Atlanta-Sandy Springs-Alpharetta, GA",null,"GA","Carroll",null,null,"Clark"]
["Catoosa, GA",0.83650000000000002,"16860","Chattanooga, TN-GA",null,"GA","Catoosa",null,null,"Crittenden"]
["Charlton, GA",0.71809999999999996,"99911","Georgia",null,"GA","Charlton",null,null,"Fulton"]
["Chatham, GA",0.79210000000000003,"42340","Savannah, GA",null,"GA","Chatham",null,null,"Grant"]
["Chattahoochee, GA",0.78659999999999997,"17980","Columbus, GA-AL",null,"GA","Chattahoochee",null,null,"Johnson"]
["Chattooga, GA",0.71809999999999996,"99911","Georgia",null,"GA","Chattooga",null,null,"Lincoln"]
["Cherokee, GA",0.94630000000000003,"12060","Atlanta-Sandy Springs-Alpharetta, GA",null,"GA","Cherokee",null,null,"Logan"]
["Clarke, GA",0.87139999999999995,"12020","Athens-Clarke County, GA",null,"GA","Clarke",null,null,"Pulaski"]
["Clay, GA",0.71809999999999996,"99911","Georgia",null,"GA","Clay",null,null,"Scott"]
["Clayton, GA",0.94630000000000003,"12060","Atlanta-Sandy Springs-Alpharetta, GA",null,"GA","Clayton",null,null,"Union"]
["Clinch, GA",0.71809999999999996,"99911","Georgia",null,"GA","Clinch",null,null,"Martin"]
["Cobb, GA",0.94630000000000003,"12060","Atlanta-Sandy Springs-Alpharetta, GA",null,"GA","Cobb",null,null,"Taylor"]
["Coffee, GA",0.71809999999999996,"99911","Georgia",null,"GA","Coffee",null,null,"Floyd"]
["Colquitt, GA",0.71809999999999996,"99911","Georgia",null,"GA","Colquitt",null,null,"Hancock"]
["Columbia, GA",0.86529999999999996,"12260","Augusta-Richmond County, GA-SC",null,"GA","Columbia",null,null,"Hart"]
["Cook, GA",0.71809999999999996,"99911","Georgia",null,"GA","Cook",null,null,"Warren"]
["Coweta, GA",0.94630000000000003,"12060","Atlanta-Sandy Springs-Alpharetta, GA",null,"GA","Coweta",null,null,"Wayne"]
["Crawford, GA",0.91359999999999997,"31420","Macon-Bibb County, GA",null,"GA","Crawford",null,null,"Webster"]
["Crisp, GA",0.71809999999999996,"99911","Georgia",null,"GA","Crisp",null,null,"Lewis"]
["Dade, GA",0.83650000000000002,"16860","Chattanooga, TN-GA",null,"GA","Dade",null,null,"Christian"]
["Dawson, GA",0.94630000000000003,"12060","Atlanta-Sandy Springs-Alpharetta, GA",null,"GA","Dawson",null,null,"Clinton"]
["Decatur, GA",0.71809999999999996,"99911","Georgia",null,"GA","Decatur",null,null,"Cumberland"]
["De Kalb, GA",0.94630000000000003,"12060","Atlanta-Sandy Springs-Alpharetta, GA",null,"GA","De Kalb",null,null,"Gallatin"]
["Dodge, GA",0.71809999999999996,"99911","Georgia",null,"GA","Dodge",null,null,"Hardin"]
["Dooly, GA",0.71809999999999996,"99911","Georgia",null,"GA","Dooly",null,null,"Henderson"]
["Dougherty, GA",0.8206,"10500","Albany, GA",null,"GA","Dougherty",null,null,"Knox"]
["Douglas, GA",0.94630000000000003,"12060","Atlanta-Sandy Springs-Alpharetta, GA",null,"GA","Douglas",null,null,"Livingston"]
["Early, GA",0.71809999999999996,"99911","Georgia",null,"GA","Early",null,null,"Mc Lean"]
["Echols, GA",0.7248,"46660","Valdosta, GA",null,"GA","Echols",null,null,"Mason"]
["Effingham, GA",0.79210000000000003,"42340","Savannah, GA",null,"GA","Effingham",null,null,"Mercer"]
["Elbert, GA",0.71809999999999996,"99911","Georgia",null,"GA","Elbert",null,null,"Woodford"]
["Emanuel, GA",0.71809999999999996,"99911","Georgia",null,"GA","Emanuel",null,null,"Allen"]
["Evans, GA",0.71809999999999996,"99911","Georgia",null,"GA","Evans",null,null,"Daviess"]
["Fannin, GA",0.71809999999999996,"99911","Georgia",null,"GA","Fannin",null,null,"Harrison"]
["Fayette, GA",0.94630000000000003,"12060","Atlanta-Sandy Springs-Alpharetta, GA",null,"GA","Fayette",null,null,"Ohio"]
["Floyd, GA",0.88119999999999998,"40660","Rome, GA",null,"GA","Floyd",null,null,"Owen"]
["Forsyth, GA",0.94630000000000003,"12060","Atlanta-Sandy Springs-Alpharetta, GA",null,"GA","Forsyth",null,null,"Spencer"]
["Franklin, GA",0.71809999999999996,"99911","Georgia",null,"GA","Franklin",null,null,"Whitley"]
["Fulton, GA",0.94630000000000003,"12060","Atlanta-Sandy Springs-Alpharetta, GA",null,"GA","Fulton",null,null,"Adair"]
["Gilmer, GA",0.71809999999999996,"99911","Georgia",null,"GA","Gilmer",null,null,"Lyon"]
["Glascock, GA",0.71809999999999996,"99911","Georgia",null,"GA","Glascock",null,null,"Anderson"]
["Glynn, GA",0.76959999999999995,"15260","Brunswick, GA",null,"GA","Glynn",null,null,"Bourbon"]
["Gordon, GA",0.71809999999999996,"99911","Georgia",null,"GA","Gordon",null,null,"Meade"]
["Grady, GA",0.71809999999999996,"99911","Georgia",null,"GA","Grady",null,null,"Ballard"]
["Greene, GA",0.71809999999999996,"99911","Georgia",null,"GA","Greene",null,null,"Barren"]
["Gwinnett, GA",0.94630000000000003,"12060","Atlanta-Sandy Springs-Alpharetta, GA",null,"GA","Gwinnett",null,null,"Bath"]
["Habersham, GA",0.71809999999999996,"99911","Georgia",null,"GA","Habersham",null,null,"Bell"]
["Hall, GA",0.91830000000000001,"23580","Gainesville, GA",null,"GA","Hall",null,null,"Boyd"]
["Hancock, GA",0.71809999999999996,"99911","Georgia",null,"GA","Hancock",null,null,"Boyle"]
["Haralson, GA",0.94630000000000003,"12060","Atlanta-Sandy Springs-Alpharetta, GA",null,"GA","Haralson",null,null,"Bracken"]
["Harris, GA",0.78659999999999997,"17980","Columbus, GA-AL",null,"GA","Harris",null,null,"Breathitt"]
["Hart, GA",0.71809999999999996,"99911","Georgia",null,"GA","Hart",null,null,"Breckinridge"]
["Heard, GA",0.94630000000000003,"12060","Atlanta-Sandy Springs-Alpharetta, GA",null,"GA","Heard",null,null,"Bullitt"]
["Henry, GA",0.94630000000000003,"12060","Atlanta-Sandy Springs-Alpharetta, GA",null,"GA","Henry",null,null,"Caldwell"]
["Houston, GA",0.74219999999999997,"47580","Warner Robins, GA",null,"GA","Houston",null,null,"Calloway"]
["Irwin, GA",0.71809999999999996,"99911","Georgia",null,"GA","Irwin",null,null,"Campbell"]
["Jackson, GA",0.71809999999999996,"99911","Georgia",null,"GA","Jackson",null,null,"Carlisle"]
["Jasper, GA",0.94630000000000003,"12060","Atlanta-Sandy Springs-Alpharetta, GA",null,"GA","Jasper",null,null,"Carter"]
["Jeff Davis, GA",0.71809999999999996,"99911","Georgia",null,"GA","Jeff Davis",null,null,"Casey"]
["Jefferson, GA",0.71809999999999996,"99911","Georgia",null,"GA","Jefferson",null,null,"Edmonson"]
["Jenkins, GA",0.71809999999999996,"99911","Georgia",null,"GA","Jenkins",null,null,"Elliott"]
["Johnson, GA",0.71809999999999996,"99911","Georgia",null,"GA","Johnson",null,null,"Estill"]
["Jones, GA",0.91359999999999997,"31420","Macon-Bibb County, GA",null,"GA","Jones",null,null,"Fleming"]
["Lamar, GA",0.94630000000000003,"12060","Atlanta-Sandy Springs-Alpharetta, GA",null,"GA","Lamar",null,null,"Garrard"]
["Lanier, GA",0.7248,"46660","Valdosta, GA",null,"GA","Lanier",null,null,"Graves"]
["Laurens, GA",0.71809999999999996,"99911","Georgia",null,"GA","Laurens",null,null,"Grayson"]
["Lee, GA",0.8206,"10500","Albany, GA",null,"GA","Lee",null,null,"Green"]
["Liberty, GA",0.83879999999999999,"25980","Hinesville, GA",null,"GA","Liberty",null,null,"Greenup"]
["Lincoln, GA",0.86529999999999996,"12260","Augusta-Richmond County, GA-SC",null,"GA","Lincoln",null,null,"Harlan"]
["Long, GA",0.83879999999999999,"25980","Hinesville, GA",null,"GA","Long",null,null,"Hickman"]
["Lowndes, GA",0.7248,"46660","Valdosta, GA",null,"GA","Lowndes",null,null,"Hopkins"]
["Lumpkin, GA",0.71809999999999996,"99911","Georgia",null,"GA","Lumpkin",null,null,"Jessamine"]
["Mc Duffie, GA",0.86529999999999996,"12260","Augusta-Richmond County, GA-SC",null,"GA","Mc Duffie",null,null,"Kenton"]
["Mc Intosh, GA",0.76959999999999995,"15260","Brunswick, GA",null,"GA","Mc Intosh",null,null,"Knott"]
["Macon, GA",0.71809999999999996,"99911","Georgia",null,"GA","Macon",null,null,"Larue"]
["Madison, GA",0.87139999999999995,"12020","Athens-Clarke County, GA",null,"GA","Madison",null,null,"Laurel"]
["Marion, GA",0.78659999999999997,"17980","Columbus, GA-AL",null,"GA","Marion",null,null,"Leslie"]
["Meriwether, GA",0.94630000000000003,"12060","Atlanta-Sandy Springs-Alpharetta, GA",null,"GA","Meriwether",null,null,"Letcher"]
["Miller, GA",0.71809999999999996,"99911","Georgia",null,"GA","Miller",null,null,"Mc Cracken"]
["Mitchell, GA",0.71809999999999996,"99911","Georgia",null,"GA","Mitchell",null,null,"Mc Creary"]
["Monroe, GA",0.91359999999999997,"31420","Macon-Bibb County, GA",null,"GA","Monroe",null,null,"Magoffin"]
["Montgomery, GA",0.71809999999999996,"99911","Georgia",null,"GA","Montgomery",null,null,"Menifee"]
["Morgan, GA",0.94630000000000003,"12060","Atlanta-Sandy Springs-Alpharetta, GA",null,"GA","Morgan",null,null,"Metcalfe"]
["Murray, GA",0.88470000000000004,"19140","Dalton, GA",null,"GA","Murray",null,null,"Muhlenberg"]
["Muscogee, GA",0.78659999999999997,"17980","Columbus, GA-AL",null,"GA","Muscogee",null,null,"Nelson"]
["Newton, GA",0.94630000000000003,"12060","Atlanta-Sandy Springs-Alpharetta, GA",null,"GA","Newton",null,null,"Nicholas"]
["Oconee, GA",0.87139999999999995,"12020","Athens-Clarke County, GA",null,"GA","Oconee",null,null,"Oldham"]
["Oglethorpe, GA",0.87139999999999995,"12020","Athens-Clarke County, GA",null,"GA","Oglethorpe",null,null,"Owsley"]
["Paulding, GA",0.94630000000000003,"12060","Atlanta-Sandy Springs-Alpharetta, GA",null,"GA","Paulding",null,null,"Pendleton"]
["Peach, GA",0.74219999999999997,"47580","Warner Robins, GA",null,"GA","Peach",null,null,"Powell"]
["Pickens, GA",0.94630000000000003,"12060","Atlanta-Sandy Springs-Alpharetta, GA",null,"GA","Pickens",null,null,"Robertson"]
["Pierce, GA",0.71809999999999996,"99911","Georgia",null,"GA","Pierce",null,null,"Rockcastle"]
["Pike, GA",0.94630000000000003,"12060","Atlanta-Sandy Springs-Alpharetta, GA",null,"GA","Pike",null,null,"Rowan"]
["Polk, GA",0.71809999999999996,"99911","Georgia",null,"GA","Polk",null,null,"Simpson"]
["Pulaski, GA",0.71809999999999996,"99911","Georgia",null,"GA","Pulaski",null,null,"Todd"]
["Putnam, GA",0.71809999999999996,"99911","Georgia",null,"GA","Putnam",null,null,"Trigg"]
["Quitman, GA",0.71809999999999996,"99911","Georgia",null,"GA","Quitman",null,null,"Trimble"]
["Rabun, GA",0.71809999999999996,"99911","Georgia",null,"GA","Rabun",null,null,"Wolfe"]
["Randolph, GA",0.71809999999999996,"99911","Georgia",null,"GA","Randolph",null,"MO","Butler"]
["Richmond, GA",0.86529999999999996,"12260","Augusta-Richmond County, GA-SC",null,"GA","Richmond",null,null,"Clay"]
["Rockdale, GA",0.94630000000000003,"12060","Atlanta-Sandy Springs-Alpharetta, GA",null,"GA","Rockdale",null,null,"Dallas"]
["Schley, GA",0.71809999999999996,"99911","Georgia",null,"GA","Schley",null,null,"De Kalb"]
["Screven, GA",0.71809999999999996,"99911","Georgia",null,"GA","Screven",null,null,"Franklin"]
["Seminole, GA",0.71809999999999996,"99911","Georgia",null,"GA","Seminole",null,null,"Greene"]
["Spalding, GA",0.94630000000000003,"12060","Atlanta-Sandy Springs-Alpharetta, GA",null,"GA","Spalding",null,null,"Henry"]
["Stephens, GA",0.71809999999999996,"99911","Georgia",null,"GA","Stephens",null,null,"Jackson"]
["Stewart, GA",0.78659999999999997,"17980","Columbus, GA-AL",null,"GA","Stewart",null,null,"Jefferson"]
["Sumter, GA",0.71809999999999996,"99911","Georgia",null,"GA","Sumter",null,null,"Lawrence"]
["Talbot, GA",0.78659999999999997,"17980","Columbus, GA-AL",null,"GA","Talbot",null,null,"Macon"]
["Taliaferro, GA",0.71809999999999996,"99911","Georgia",null,"GA","Taliaferro",null,null,"Madison"]
["Tattnall, GA",0.71809999999999996,"99911","Georgia",null,"GA","Tattnall",null,null,"Marion"]
["Taylor, GA",0.71809999999999996,"99911","Georgia",null,"GA","Taylor",null,null,"Monroe"]
["Telfair, GA",0.71809999999999996,"99911","Georgia",null,"GA","Telfair",null,null,"Montgomery"]
["Terrell, GA",0.8206,"10500","Albany, GA",null,"GA","Terrell",null,null,"Morgan"]
["Thomas, GA",0.71809999999999996,"99911","Georgia",null,"GA","Thomas",null,null,"Perry"]
["Tift, GA",0.71809999999999996,"99911","Georgia",null,"GA","Tift",null,null,"Pike"]
["Toombs, GA",0.71809999999999996,"99911","Georgia",null,"GA","Toombs",null,null,"Randolph"]
["Towns, GA",0.71809999999999996,"99911","Georgia",null,"GA","Towns",null,null,"St. Clair"]
["Treutlen, GA",0.71809999999999996,"99911","Georgia",null,"GA","Treutlen",null,null,"Shelby"]
["Troup, GA",0.71809999999999996,"99911","Georgia",null,"GA","Troup",null,null,"Washington"]
["Turner, GA",0.71809999999999996,"99911","Georgia",null,"GA","Turner",null,null,"Benton"]
["Twiggs, GA",0.91359999999999997,"31420","Macon-Bibb County, GA",null,"GA","Twiggs",null,null,"Boone"]
["Union, GA",0.71809999999999996,"99911","Georgia",null,"GA","Union",null,null,"Carroll"]
["Upson, GA",0.71809999999999996,"99911","Georgia",null,"GA","Upson",null,null,"Clark"]
["Walker, GA",0.83650000000000002,"16860","Chattanooga, TN-GA",null,"GA","Walker",null,null,"Crawford"]
["Walton, GA",0.94630000000000003,"12060","Atlanta-Sandy Springs-Alpharetta, GA",null,"GA","Walton",null,null,"Howard"]
["Ware, GA",0.71809999999999996,"99911","Georgia",null,"GA","Ware",null,null,"Johnson"]
["Warren, GA",0.71809999999999996,"99911","Georgia",null,"GA","Warren",null,null,"Lafayette"]
["Washington, GA",0.71809999999999996,"99911","Georgia",null,"GA","Washington",null,null,"Lincoln"]
["Wayne, GA",0.71809999999999996,"99911","Georgia",null,"GA","Wayne",null,null,"Miller"]
["Webster, GA",0.71809999999999996,"99911","Georgia",null,"GA","Webster",null,null,"Mississippi"]
["Wheeler, GA",0.71809999999999996,"99911","Georgia",null,"GA","Wheeler",null,null,"Newton"]
["White, GA",0.71809999999999996,"99911","Georgia",null,"GA","White",null,null,"Polk"]
["Whitfield, GA",0.88470000000000004,"19140","Dalton, GA",null,"GA","Whitfield",null,null,"Pulaski"]
["Wilcox, GA",0.71809999999999996,"99911","Georgia",null,"GA","Wilcox",null,null,"Saline"]
["Wilkes, GA",0.71809999999999996,"99911","Georgia",null,"GA","Wilkes",null,null,"Scott"]
["Wilkinson, GA",0.71809999999999996,"99911","Georgia",null,"GA","Wilkinson",null,null,"Stone"]
["Worth, GA",0.8206,"10500","Albany, GA",null,"GA","Worth",null,null,"Douglas"]
["Kalawao, HI",1.2584,"99912","Hawaii",null,"HI","Kalawao",null,null,"Putnam"]
["Hawaii, HI",1.2584,"99912","Hawaii",null,"HI","Hawaii",null,null,"Camden"]
["Honolulu, HI",1.2484999999999999,"46520","Urban Honolulu, HI",null,"HI","Honolulu",null,null,"Dade"]
["Kauai, HI",1.2584,"99912","Hawaii",null,"HI","Kauai",null,null,"Jasper"]
["Maui, HI",1.2196,"27980","Kahului-Wailuku-Lahaina, HI",null,"HI","Maui",null,null,"Warren"]
["Ada, ID",0.92889999999999995,"14260","Boise City, ID",null,"ID","Ada",null,null,"Wayne"]
["Adams, ID",0.78259999999999996,"99913","Idaho",null,"ID","Adams",null,null,"Webster"]
["Bannock, ID",0.94589999999999996,"38540","Pocatello, ID",null,"ID","Bannock",null,null,"Worth"]
["Bear Lake, ID",0.78259999999999996,"99913","Idaho",null,"ID","Bear Lake",null,null,"Lewis"]
["Benewah, ID",0.78259999999999996,"99913","Idaho",null,"ID","Benewah",null,null,"Cass"]
["Bingham, ID",0.78259999999999996,"99913","Idaho",null,"ID","Bingham",null,null,"Christian"]
["Blaine, ID",0.78259999999999996,"99913","Idaho",null,"ID","Blaine",null,null,"Clinton"]
["Boise, ID",0.92889999999999995,"14260","Boise City, ID",null,"ID","Boise",null,null,"Grundy"]
["Bonner, ID",0.78259999999999996,"99913","Idaho",null,"ID","Bonner",null,null,"Knox"]
["Bonneville, ID",0.8639,"26820","Idaho Falls, ID",null,"ID","Bonneville",null,null,"Livingston"]
["Boundary, ID",0.78259999999999996,"99913","Idaho",null,"ID","Boundary",null,null,"Mercer"]
["Butte, ID",0.8639,"26820","Idaho Falls, ID",null,"ID","Butte",null,null,"Schuyler"]
["Camas, ID",0.78259999999999996,"99913","Idaho",null,"ID","Camas",null,null,"Daviess"]
["Canyon, ID",0.92889999999999995,"14260","Boise City, ID",null,"ID","Canyon",null,null,"Harrison"]
["Caribou, ID",0.78259999999999996,"99913","Idaho",null,"ID","Caribou",null,null,"Ripley"]
["Cassia, ID",0.78259999999999996,"99913","Idaho",null,"ID","Cassia",null,null,"Sullivan"]
["Clark, ID",0.78259999999999996,"99913","Idaho",null,"ID","Clark",null,null,"Adair"]
["Clearwater, ID",0.78259999999999996,"99913","Idaho",null,"ID","Clearwater",null,null,"Buchanan"]
["Custer, ID",0.78259999999999996,"99913","Idaho",null,"ID","Custer",null,null,"Cedar"]
["Elmore, ID",0.78259999999999996,"99913","Idaho",null,"ID","Elmore",null,null,"Linn"]
["Franklin, ID",0.90259999999999996,"30860","Logan, UT-ID",null,"ID","Franklin",null,null,"Wright"]
["Fremont, ID",0.78259999999999996,"99913","Idaho",null,"ID","Fremont",null,null,"Atchison"]
["Gem, ID",0.92889999999999995,"14260","Boise City, ID",null,"ID","Gem",null,null,"Barton"]
["Gooding, ID",0.78259999999999996,"99913","Idaho",null,"ID","Gooding",null,null,"Osage"]
["Idaho, ID",0.78259999999999996,"99913","Idaho",null,"ID","Idaho",null,null,"Caldwell"]
["Jefferson, ID",0.8639,"26820","Idaho Falls, ID",null,"ID","Jefferson",null,null,"Carter"]
["Jerome, ID",0.86680000000000001,"46300","Twin Falls, ID",null,"ID","Jerome",null,null,"St. Charles"]
["Kootenai, ID",0.92490000000000006,"17660","Coeur d'Alene, ID",null,"ID","Kootenai",null,null,"Vernon"]
["Latah, ID",0.78259999999999996,"99913","Idaho",null,"ID","Latah",null,null,"Barry"]
["Lemhi, ID",0.78259999999999996,"99913","Idaho",null,"ID","Lemhi",null,null,"Iron"]
["Lewis, ID",0.78259999999999996,"99913","Idaho",null,"ID","Lewis",null,null,"St. Louis"]
["Lincoln, ID",0.78259999999999996,"99913","Idaho",null,"ID","Lincoln",null,null,"Andrew"]
["Madison, ID",0.78259999999999996,"99913","Idaho",null,"ID","Madison",null,null,"Audrain"]
["Minidoka, ID",0.78259999999999996,"99913","Idaho",null,"ID","Minidoka",null,null,"Bates"]
["Nez Perce, ID",0.81499999999999995,"30300","Lewiston, ID-WA",null,"ID","Nez Perce",null,null,"Bollinger"]
["Oneida, ID",0.78259999999999996,"99913","Idaho",null,"ID","Oneida",null,null,"Callaway"]
["Owyhee, ID",0.92889999999999995,"14260","Boise City, ID",null,"ID","Owyhee",null,null,"Cape Girardeau"]
["Payette, ID",0.78259999999999996,"99913","Idaho",null,"ID","Payette",null,null,"Chariton"]
["Power, ID",0.94589999999999996,"38540","Pocatello, ID",null,"ID","Power",null,null,"Cole"]
["Shoshone, ID",0.78259999999999996,"99913","Idaho",null,"ID","Shoshone",null,null,"Cooper"]
["Teton, ID",0.78259999999999996,"99913","Idaho",null,"ID","Teton",null,null,"Dent"]
["Twin Falls, ID",0.86680000000000001,"46300","Twin Falls, ID",null,"ID","Twin Falls",null,null,"Dunklin"]
["Valley, ID",0.78259999999999996,"99913","Idaho",null,"ID","Valley",null,null,"Gasconade"]
["Washington, ID",0.78259999999999996,"99913","Idaho",null,"ID","Washington",null,null,"Gentry"]
["Adams, IL",0.82969999999999999,"99914","Illinois",null,"IL","Adams",null,null,"Hickory"]
["Alexander, IL",0.80189999999999995,"16020","Cape Girardeau, MO-IL",null,"IL","Alexander",null,null,"Holt"]
["Bond, IL",0.93169999999999997,"41180","St. Louis, MO-IL",null,"IL","Bond",null,null,"Howell"]
["Boone, IL",0.96930000000000005,"40420","Rockford, IL",null,"IL","Boone",null,null,"Laclede"]
["Brown, IL",0.82969999999999999,"99914","Illinois",null,"IL","Brown",null,null,"Mc Donald"]
["Bureau, IL",0.82969999999999999,"99914","Illinois",null,"IL","Bureau",null,null,"Maries"]
["Calhoun, IL",0.93169999999999997,"41180","St. Louis, MO-IL",null,"IL","Calhoun",null,null,"Moniteau"]
["Carroll, IL",0.82969999999999999,"99914","Illinois",null,"IL","Carroll",null,null,"New Madrid"]
["Cass, IL",0.82969999999999999,"99914","Illinois",null,"IL","Cass",null,null,"Nodaway"]
["Champaign, IL",0.86550000000000005,"16580","Champaign-Urbana, IL",null,"IL","Champaign",null,null,"Oregon"]
["Christian, IL",0.82969999999999999,"99914","Illinois",null,"IL","Christian",null,null,"Ozark"]
["Clark, IL",0.82969999999999999,"99914","Illinois",null,"IL","Clark",null,null,"Pemiscot"]
["Clay, IL",0.82969999999999999,"99914","Illinois",null,"IL","Clay",null,null,"Pettis"]
["Clinton, IL",0.93169999999999997,"41180","St. Louis, MO-IL",null,"IL","Clinton",null,null,"Phelps"]
["Coles, IL",0.82969999999999999,"99914","Illinois",null,"IL","Coles",null,null,"Platte"]
["Cook, IL",1.0442,"16984","Chicago-Naperville-Evanston, IL",null,"IL","Cook",null,null,"Ralls"]
["Crawford, IL",0.82969999999999999,"99914","Illinois",null,"IL","Crawford",null,null,"Ray"]
["Cumberland, IL",0.82969999999999999,"99914","Illinois",null,"IL","Cumberland",null,null,"Reynolds"]
["De Kalb, IL",1.0559000000000001,"20994","Elgin, IL",null,"IL","De Kalb",null,null,"St. Francois"]
["De Witt, IL",0.87729999999999997,"99914","Illinois",null,"IL","De Witt",null,null,"St. Louis City"]
["Douglas, IL",0.82969999999999999,"99914","Illinois",null,"IL","Douglas",null,null,"Ste. Genevieve"]
["Du Page, IL",1.0442,"16984","Chicago-Naperville-Evanston, IL",null,"IL","Du Page",null,null,"Scotland"]
["Edgar, IL",0.82969999999999999,"99914","Illinois",null,"IL","Edgar",null,null,"Shannon"]
["Edwards, IL",0.82969999999999999,"99914","Illinois",null,"IL","Edwards",null,null,"Stoddard"]
["Effingham, IL",0.82969999999999999,"99914","Illinois",null,"IL","Effingham",null,null,"Taney"]
["Fayette, IL",0.82969999999999999,"99914","Illinois",null,"IL","Fayette",null,null,"Texas"]
["Ford, IL",0.82969999999999999,"99914","Illinois",null,"IL","Ford",null,"OK","Cherokee"]
["Franklin, IL",0.82969999999999999,"99914","Illinois",null,"IL","Franklin",null,null,"Choctaw"]
["Fulton, IL",0.86439999999999995,"37900","Peoria, IL",null,"IL","Fulton",null,null,"Jackson"]
["Gallatin, IL",0.82969999999999999,"99914","Illinois",null,"IL","Gallatin",null,null,"Jefferson"]
["Greene, IL",0.82969999999999999,"99914","Illinois",null,"IL","Greene",null,null,"Marshall"]
["Grundy, IL",1.0442,"16984","Chicago-Naperville-Evanston, IL",null,"IL","Grundy",null,null,"Washington"]
["Hamilton, IL",0.82969999999999999,"99914","Illinois",null,"IL","Hamilton",null,null,"Cleveland"]
["Hancock, IL",0.82969999999999999,"99914","Illinois",null,"IL","Hancock",null,null,"Grant"]
["Hardin, IL",0.82969999999999999,"99914","Illinois",null,"IL","Hardin",null,null,"Lincoln"]
["Henderson, IL",0.82969999999999999,"99914","Illinois",null,"IL","Henderson",null,null,"Logan"]
["Henry, IL",0.86060000000000003,"19340","Davenport-Moline-Rock Island, IA-IL",null,"IL","Henry",null,null,"Custer"]
["Iroquois, IL",0.82969999999999999,"99914","Illinois",null,"IL","Iroquois",null,null,"Garfield"]
["Jackson, IL",0.81840000000000002,"16060","Carbondale-Marion, IL",null,"IL","Jackson",null,null,"Kiowa"]
["Jasper, IL",0.82969999999999999,"99914","Illinois",null,"IL","Jasper",null,null,"Seminole"]
["Jefferson, IL",0.82969999999999999,"99914","Illinois",null,"IL","Jefferson",null,null,"Bryan"]
["Jersey, IL",0.93169999999999997,"41180","St. Louis, MO-IL",null,"IL","Jersey",null,null,"Grady"]
["Jo Daviess, IL",0.82969999999999999,"99914","Illinois",null,"IL","Jo Daviess",null,null,"Murray"]
["Johnson, IL",0.81840000000000002,"16060","Carbondale-Marion, IL",null,"IL","Johnson",null,null,"Stephens"]
["Kane, IL",1.0559000000000001,"20994","Elgin, IL",null,"IL","Kane",null,null,"Blaine"]
["Kankakee, IL",0.90680000000000005,"28100","Kankakee, IL",null,"IL","Kankakee",null,null,"Delaware"]
["Kendall, IL",1.0559000000000001,"20994","Elgin, IL",null,"IL","Kendall",null,null,"Noble"]
["Knox, IL",0.82969999999999999,"99914","Illinois",null,"IL","Knox",null,null,"Adair"]
["Lake, IL",1.0192000000000001,"29404","Lake County-Kenosha County, IL-WI",null,"IL","Lake",null,null,"Comanche"]
["La Salle, IL",0.82969999999999999,"99914","Illinois",null,"IL","La Salle",null,null,"Ellis"]
["Lawrence, IL",0.82969999999999999,"99914","Illinois",null,"IL","Lawrence",null,null,"Harper"]
["Lee, IL",0.82969999999999999,"99914","Illinois",null,"IL","Lee",null,null,"Haskell"]
["Livingston, IL",0.82969999999999999,"99914","Illinois",null,"IL","Livingston",null,null,"Osage"]
["Logan, IL",0.82969999999999999,"99914","Illinois",null,"IL","Logan",null,null,"Ottawa"]
["Mc Donough, IL",0.82969999999999999,"99914","Illinois",null,"IL","Mc Donough",null,null,"Pawnee"]
["Mc Henry, IL",1.0442,"16984","Chicago-Naperville-Evanston, IL",null,"IL","Mc Henry",null,null,"Pottawatomie"]
["Mc Lean, IL",0.91139999999999999,"14010","Bloomington, IL",null,"IL","Mc Lean",null,null,"Carter"]
["Macon, IL",0.83260000000000001,"19500","Decatur, IL",null,"IL","Macon",null,null,"Caddo"]
["Macoupin, IL",0.93169999999999997,"41180","St. Louis, MO-IL",null,"IL","Macoupin",null,null,"Pontotoc"]
["Madison, IL",0.93169999999999997,"41180","St. Louis, MO-IL",null,"IL","Madison",null,null,"Texas"]
["Marion, IL",0.82969999999999999,"99914","Illinois",null,"IL","Marion",null,null,"Johnston"]
["Marshall, IL",0.86439999999999995,"37900","Peoria, IL",null,"IL","Marshall",null,null,"Mcintosh"]
["Mason, IL",0.82969999999999999,"99914","Illinois",null,"IL","Mason",null,null,"Alfalfa"]
["Massac, IL",0.82969999999999999,"99914","Illinois",null,"IL","Massac",null,null,"Atoka"]
["Menard, IL",0.92559999999999998,"44100","Springfield, IL",null,"IL","Menard",null,null,"Beaver"]
["Mercer, IL",0.86060000000000003,"19340","Davenport-Moline-Rock Island, IA-IL",null,"IL","Mercer",null,null,"Beckham"]
["Monroe, IL",0.93169999999999997,"41180","St. Louis, MO-IL",null,"IL","Monroe",null,null,"Canadian"]
["Montgomery, IL",0.82969999999999999,"99914","Illinois",null,"IL","Montgomery",null,null,"Cimarron"]
["Morgan, IL",0.82969999999999999,"99914","Illinois",null,"IL","Morgan",null,null,"Coal"]
["Moultrie, IL",0.82969999999999999,"99914","Illinois",null,"IL","Moultrie",null,null,"Cotton"]
["Ogle, IL",0.82969999999999999,"99914","Illinois",null,"IL","Ogle",null,null,"Craig"]
["Peoria, IL",0.86439999999999995,"37900","Peoria, IL",null,"IL","Peoria",null,null,"Creek"]
["Perry, IL",0.82969999999999999,"99914","Illinois",null,"IL","Perry",null,null,"Dewey"]
["Piatt, IL",0.86550000000000005,"16580","Champaign-Urbana, IL",null,"IL","Piatt",null,null,"Garvin"]
["Pike, IL",0.82969999999999999,"99914","Illinois",null,"IL","Pike",null,null,"Greer"]
["Pope, IL",0.82969999999999999,"99914","Illinois",null,"IL","Pope",null,null,"Harmon"]
["Pulaski, IL",0.82969999999999999,"99914","Illinois",null,"IL","Pulaski",null,null,"Hughes"]
["Putnam, IL",0.82969999999999999,"99914","Illinois",null,"IL","Putnam",null,null,"Kay"]
["Randolph, IL",0.82969999999999999,"99914","Illinois",null,"IL","Randolph",null,null,"Kingfisher"]
["Richland, IL",0.82969999999999999,"99914","Illinois",null,"IL","Richland",null,null,"Latimer"]
["Rock Island, IL",0.86060000000000003,"19340","Davenport-Moline-Rock Island, IA-IL",null,"IL","Rock Island",null,null,"Le Flore"]
["St. Clair, IL",0.93169999999999997,"41180","St. Louis, MO-IL",null,"IL","St. Clair",null,null,"Love"]
["Saline, IL",0.82969999999999999,"99914","Illinois",null,"IL","Saline",null,null,"Mcclain"]
["Sangamon, IL",0.92559999999999998,"44100","Springfield, IL",null,"IL","Sangamon",null,null,"Mccurtain"]
["Schuyler, IL",0.82969999999999999,"99914","Illinois",null,"IL","Schuyler",null,null,"Major"]
["Scott, IL",0.82969999999999999,"99914","Illinois",null,"IL","Scott",null,null,"Mayes"]
["Shelby, IL",0.82969999999999999,"99914","Illinois",null,"IL","Shelby",null,null,"Muskogee"]
["Stark, IL",0.86439999999999995,"37900","Peoria, IL",null,"IL","Stark",null,null,"Nowata"]
["Stephenson, IL",0.82969999999999999,"99914","Illinois",null,"IL","Stephenson",null,null,"Okfuskee"]
["Tazewell, IL",0.86439999999999995,"37900","Peoria, IL",null,"IL","Tazewell",null,null,"Oklahoma"]
["Union, IL",0.82969999999999999,"99914","Illinois",null,"IL","Union",null,null,"Okmulgee"]
["Vermilion, IL",0.9032,"19180","Danville, IL",null,"IL","Vermilion",null,null,"Payne"]
["Wabash, IL",0.82969999999999999,"99914","Illinois",null,"IL","Wabash",null,null,"Pittsburg"]
["Warren, IL",0.82969999999999999,"99914","Illinois",null,"IL","Warren",null,null,"Pushmataha"]
["Washington, IL",0.82969999999999999,"99914","Illinois",null,"IL","Washington",null,null,"Roger Mills"]
["Wayne, IL",0.82969999999999999,"99914","Illinois",null,"IL","Wayne",null,null,"Rogers"]
["White, IL",0.82969999999999999,"99914","Illinois",null,"IL","White",null,null,"Sequoyah"]
["Whiteside, IL",0.82969999999999999,"99914","Illinois",null,"IL","Whiteside",null,null,"Tillman"]
["Will, IL",1.0442,"16984","Chicago-Naperville-Evanston, IL",null,"IL","Will",null,null,"Tulsa"]
["Williamson, IL",0.81840000000000002,"16060","Carbondale-Marion, IL",null,"IL","Williamson",null,null,"Wagoner"]
["Winnebago, IL",0.96930000000000005,"40420","Rockford, IL",null,"IL","Winnebago",null,null,"Washita"]
["Woodford, IL",0.86439999999999995,"37900","Peoria, IL",null,"IL","Woodford",null,null,"Woods"]
["Adams, IN",0.83540000000000003,"99915","Indiana",null,"IN","Adams",null,null,"Woodward"]
["Allen, IN",0.91720000000000002,"23060","Fort Wayne, IN",null,"IN","Allen",null,"CO","Jackson"]
["Bartholomew, IN",1.0026999999999999,"18020","Columbus, IN",null,"IN","Bartholomew",null,null,"Jefferson"]
["Benton, IN",0.98299999999999998,"29200","Lafayette-West Lafayette, IN",null,"IN","Benton",null,null,"Morgan"]
["Blackford, IN",0.83540000000000003,"99915","Indiana",null,"IN","Blackford",null,null,"Washington"]
["Boone, IN",0.99539999999999995,"26900","Indianapolis-Carmel-Anderson, IN",null,"IN","Boone",null,null,"Yuma"]
["Brown, IN",0.99539999999999995,"26900","Indianapolis-Carmel-Anderson, IN",null,"IN","Brown",null,null,"Lincoln"]
["Carroll, IN",0.98299999999999998,"29200","Lafayette-West Lafayette, IN",null,"IN","Carroll",null,null,"Logan"]
["Cass, IN",0.83540000000000003,"99915","Indiana",null,"IN","Cass",null,null,"Phillips"]
["Clark, IN",0.86970000000000003,"31140","Louisville/Jefferson County, KY-IN",null,"IN","Clark",null,null,"Lake"]
["Clay, IN",0.89490000000000003,"45460","Terre Haute, IN",null,"IN","Clay",null,null,"Adams"]
["Clinton, IN",0.83540000000000003,"99915","Indiana",null,"IN","Clinton",null,null,"Alamosa"]
["Crawford, IN",0.83540000000000003,"99915","Indiana",null,"IN","Crawford",null,null,"Arapahoe"]
["Daviess, IN",0.83540000000000003,"99915","Indiana",null,"IN","Daviess",null,null,"Archuleta"]
["Dearborn, IN",0.94610000000000005,"17140","Cincinnati, OH-KY-IN",null,"IN","Dearborn",null,null,"Baca"]
["Decatur, IN",0.83540000000000003,"99915","Indiana",null,"IN","Decatur",null,null,"Bent"]
["De Kalb, IN",0.83540000000000003,"99915","Indiana",null,"IN","De Kalb",null,null,"Boulder"]
["Delaware, IN",0.99270000000000003,"34620","Muncie, IN",null,"IN","Delaware",null,null,"Chaffee"]
["Dubois, IN",0.83540000000000003,"99915","Indiana",null,"IN","Dubois",null,null,"Cheyenne"]
["Elkhart, IN",0.97589999999999999,"21140","Elkhart-Goshen, IN",null,"IN","Elkhart",null,null,"Clear Creek"]
["Fayette, IN",0.83540000000000003,"99915","Indiana",null,"IN","Fayette",null,null,"Conejos"]
["Floyd, IN",0.86970000000000003,"31140","Louisville/Jefferson County, KY-IN",null,"IN","Floyd",null,null,"Costilla"]
["Fountain, IN",0.83540000000000003,"99915","Indiana",null,"IN","Fountain",null,null,"Crowley"]
["Franklin, IN",0.94610000000000005,"17140","Cincinnati, OH-KY-IN",null,"IN","Franklin",null,null,"Custer"]
["Fulton, IN",0.83540000000000003,"99915","Indiana",null,"IN","Fulton",null,null,"Delta"]
["Gibson, IN",0.83540000000000003,"99915","Indiana",null,"IN","Gibson",null,null,"Denver"]
["Grant, IN",0.83540000000000003,"99915","Indiana",null,"IN","Grant",null,null,"Dolores"]
["Greene, IN",0.83540000000000003,"99915","Indiana",null,"IN","Greene",null,null,"Douglas"]
["Hamilton, IN",0.99539999999999995,"26900","Indianapolis-Carmel-Anderson, IN",null,"IN","Hamilton",null,null,"Eagle"]
["Hancock, IN",0.99539999999999995,"26900","Indianapolis-Carmel-Anderson, IN",null,"IN","Hancock",null,null,"Elbert"]
["Harrison, IN",0.86970000000000003,"31140","Louisville/Jefferson County, KY-IN",null,"IN","Harrison",null,null,"El Paso"]
["Hendricks, IN",0.99539999999999995,"26900","Indianapolis-Carmel-Anderson, IN",null,"IN","Hendricks",null,null,"Fremont"]
["Henry, IN",0.83540000000000003,"99915","Indiana",null,"IN","Henry",null,null,"Garfield"]
["Howard, IN",0.95230000000000004,"29020","Kokomo, IN",null,"IN","Howard",null,null,"Gilpin"]
["Huntington, IN",0.83540000000000003,"99915","Indiana",null,"IN","Huntington",null,null,"Grand"]
["Jackson, IN",0.83540000000000003,"99915","Indiana",null,"IN","Jackson",null,null,"Gunnison"]
["Jasper, IN",0.91579999999999995,"23844","Gary, IN",null,"IN","Jasper",null,null,"Hinsdale"]
["Jay, IN",0.83540000000000003,"99915","Indiana",null,"IN","Jay",null,null,"Huerfano"]
["Jefferson, IN",0.83540000000000003,"99915","Indiana",null,"IN","Jefferson",null,null,"Kiowa"]
["Jennings, IN",0.83540000000000003,"99915","Indiana",null,"IN","Jennings",null,null,"Kit Carson"]
["Johnson, IN",0.99539999999999995,"26900","Indianapolis-Carmel-Anderson, IN",null,"IN","Johnson",null,null,"La Plata"]
["Knox, IN",0.83540000000000003,"99915","Indiana",null,"IN","Knox",null,null,"Larimer"]
["Kosciusko, IN",0.83540000000000003,"99915","Indiana",null,"IN","Kosciusko",null,null,"Las Animas"]
["Lagrange, IN",0.83540000000000003,"99915","Indiana",null,"IN","Lagrange",null,null,"Mesa"]
["Lake, IN",0.91579999999999995,"23844","Gary, IN",null,"IN","Lake",null,null,"Mineral"]
["La Porte, IN",0.9284,"33140","Michigan City-La Porte, IN",null,"IN","La Porte",null,null,"Moffat"]
["Lawrence, IN",0.83540000000000003,"99915","Indiana",null,"IN","Lawrence",null,null,"Montezuma"]
["Madison, IN",0.99539999999999995,"26900","Indianapolis-Carmel-Anderson, IN",null,"IN","Madison",null,null,"Montrose"]
["Marion, IN",0.99539999999999995,"26900","Indianapolis-Carmel-Anderson, IN",null,"IN","Marion",null,null,"Otero"]
["Marshall, IN",0.83540000000000003,"99915","Indiana",null,"IN","Marshall",null,null,"Ouray"]
["Martin, IN",0.83540000000000003,"99915","Indiana",null,"IN","Martin",null,null,"Park"]
["Miami, IN",0.83540000000000003,"99915","Indiana",null,"IN","Miami",null,null,"Pitkin"]
["Monroe, IN",0.93020000000000003,"14020","Bloomington, IN",null,"IN","Monroe",null,null,"Prowers"]
["Montgomery, IN",0.83540000000000003,"99915","Indiana",null,"IN","Montgomery",null,null,"Pueblo"]
["Morgan, IN",0.99539999999999995,"26900","Indianapolis-Carmel-Anderson, IN",null,"IN","Morgan",null,null,"Rio Blanco"]
["Newton, IN",0.91579999999999995,"23844","Gary, IN",null,"IN","Newton",null,null,"Rio Grande"]
["Noble, IN",0.83540000000000003,"99915","Indiana",null,"IN","Noble",null,null,"Routt"]
["Ohio, IN",0.94610000000000005,"17140","Cincinnati, OH-KY-IN",null,"IN","Ohio",null,null,"Saguache"]
["Orange, IN",0.83540000000000003,"99915","Indiana",null,"IN","Orange",null,null,"San Juan"]
["Owen, IN",0.93020000000000003,"14020","Bloomington, IN",null,"IN","Owen",null,null,"San Miguel"]
["Parke, IN",0.89490000000000003,"45460","Terre Haute, IN",null,"IN","Parke",null,null,"Sedgwick"]
["Perry, IN",0.83540000000000003,"99915","Indiana",null,"IN","Perry",null,null,"Summit"]
["Pike, IN",0.83540000000000003,"99915","Indiana",null,"IN","Pike",null,null,"Teller"]
["Porter, IN",0.91579999999999995,"23844","Gary, IN",null,"IN","Porter",null,null,"Weld"]
["Posey, IN",0.92559999999999998,"21780","Evansville, IN-KY",null,"IN","Posey",null,null,"Broomfield"]
["Pulaski, IN",0.83540000000000003,"99915","Indiana",null,"IN","Pulaski",null,"IL","Calhoun"]
["Putnam, IN",0.99539999999999995,"26900","Indianapolis-Carmel-Anderson, IN",null,"IN","Putnam",null,null,"Clay"]
["Randolph, IN",0.83540000000000003,"99915","Indiana",null,"IN","Randolph",null,null,"De Kalb"]
["Ripley, IN",0.83540000000000003,"99915","Indiana",null,"IN","Ripley",null,null,"Fayette"]
["Rush, IN",0.83540000000000003,"99915","Indiana",null,"IN","Rush",null,null,"Franklin"]
["St. Joseph, IN",0.96750000000000003,"43780","South Bend-Mishawaka, IN-MI",null,"IN","St. Joseph",null,null,"Greene"]
["Scott, IN",0.84019999999999995,"99915","Indiana",null,"IN","Scott",null,null,"Henry"]
["Shelby, IN",0.99539999999999995,"26900","Indianapolis-Carmel-Anderson, IN",null,"IN","Shelby",null,null,"Jackson"]
["Spencer, IN",0.83540000000000003,"99915","Indiana",null,"IN","Spencer",null,null,"Jefferson"]
["Starke, IN",0.83540000000000003,"99915","Indiana",null,"IN","Starke",null,null,"Lawrence"]
["Steuben, IN",0.83540000000000003,"99915","Indiana",null,"IN","Steuben",null,null,"Lee"]
["Sullivan, IN",0.89490000000000003,"45460","Terre Haute, IN",null,"IN","Sullivan",null,null,"Macon"]
["Switzerland, IN",0.83540000000000003,"99915","Indiana",null,"IN","Switzerland",null,null,"Madison"]
["Tippecanoe, IN",0.98299999999999998,"29200","Lafayette-West Lafayette, IN",null,"IN","Tippecanoe",null,null,"Marion"]
["Tipton, IN",0.83540000000000003,"99915","Indiana",null,"IN","Tipton",null,null,"Marshall"]
["Union, IN",0.94610000000000005,"17140","Cincinnati, OH-KY-IN",null,"IN","Union",null,null,"Monroe"]
["Vanderburgh, IN",0.92559999999999998,"21780","Evansville, IN-KY",null,"IN","Vanderburgh",null,null,"Montgomery"]
["Vermillion, IN",0.89490000000000003,"45460","Terre Haute, IN",null,"IN","Vermillion",null,null,"Morgan"]
["Vigo, IN",0.89490000000000003,"45460","Terre Haute, IN",null,"IN","Vigo",null,null,"Perry"]
["Wabash, IN",0.83540000000000003,"99915","Indiana",null,"IN","Wabash",null,null,"Pike"]
["Warren, IN",0.98299999999999998,"29200","Lafayette-West Lafayette, IN",null,"IN","Warren",null,null,"Randolph"]
["Warrick, IN",0.92559999999999998,"21780","Evansville, IN-KY",null,"IN","Warrick",null,null,"St. Clair"]
["Washington, IN",0.86970000000000003,"31140","Louisville/Jefferson County, KY-IN",null,"IN","Washington",null,null,"Shelby"]
["Wayne, IN",0.83540000000000003,"99915","Indiana",null,"IN","Wayne",null,null,"Washington"]
["Wells, IN",0.83540000000000003,"99915","Indiana",null,"IN","Wells",null,null,"Boone"]
["White, IN",0.83540000000000003,"99915","Indiana",null,"IN","White",null,null,"Carroll"]
["Whitley, IN",0.91720000000000002,"23060","Fort Wayne, IN",null,"IN","Whitley",null,null,"Clark"]
["Adair, IA",0.84030000000000005,"99916","Iowa",null,"IA","Adair",null,null,"Crawford"]
["Adams, IA",0.84030000000000005,"99916","Iowa",null,"IA","Adams",null,null,"Fulton"]
["Allamakee, IA",0.84030000000000005,"99916","Iowa",null,"IA","Allamakee",null,null,"Johnson"]
["Appanoose, IA",0.84030000000000005,"99916","Iowa",null,"IA","Appanoose",null,null,"Logan"]
["Audubon, IA",0.84030000000000005,"99916","Iowa",null,"IA","Audubon",null,null,"Pope"]
["Benton, IA",0.86240000000000006,"16300","Cedar Rapids, IA",null,"IA","Benton",null,null,"Pulaski"]
["Black Hawk, IA",0.78900000000000003,"47940","Waterloo-Cedar Falls, IA",null,"IA","Black Hawk",null,null,"Saline"]
["Boone, IA",0.9214,"11180","Ames, IA",null,"IA","Boone",null,null,"Scott"]
["Bremer, IA",0.78900000000000003,"47940","Waterloo-Cedar Falls, IA",null,"IA","Bremer",null,null,"Union"]
["Buchanan, IA",0.84030000000000005,"99916","Iowa",null,"IA","Buchanan",null,null,"White"]
["Buena Vista, IA",0.84030000000000005,"99916","Iowa",null,"IA","Buena Vista",null,null,"Lake"]
["Butler, IA",0.84030000000000005,"99916","Iowa",null,"IA","Butler",null,null,"Adams"]
["Calhoun, IA",0.84030000000000005,"99916","Iowa",null,"IA","Calhoun",null,null,"Douglas"]
["Carroll, IA",0.84030000000000005,"99916","Iowa",null,"IA","Carroll",null,null,"Hamilton"]
["Cass, IA",0.84030000000000005,"99916","Iowa",null,"IA","Cass",null,null,"Putnam"]
["Cedar, IA",0.84030000000000005,"99916","Iowa",null,"IA","Cedar",null,null,"Cook"]
["Cerro Gordo, IA",0.84030000000000005,"99916","Iowa",null,"IA","Cerro Gordo",null,null,"Effingham"]
["Cherokee, IA",0.84030000000000005,"99916","Iowa",null,"IA","Cherokee",null,null,"Hancock"]
["Chickasaw, IA",0.84030000000000005,"99916","Iowa",null,"IA","Chickasaw",null,null,"Jasper"]
["Clarke, IA",0.84030000000000005,"99916","Iowa",null,"IA","Clarke",null,null,"Warren"]
["Clay, IA",0.84030000000000005,"99916","Iowa",null,"IA","Clay",null,null,"Wayne"]
["Clayton, IA",0.84030000000000005,"99916","Iowa",null,"IA","Clayton",null,null,"Alexander"]
["Clinton, IA",0.84030000000000005,"99916","Iowa",null,"IA","Clinton",null,null,"Bond"]
["Crawford, IA",0.84030000000000005,"99916","Iowa",null,"IA","Crawford",null,null,"Brown"]
["Dallas, IA",0.88890000000000002,"19780","Des Moines-West Des Moines, IA",null,"IA","Dallas",null,null,"Bureau"]
["Davis, IA",0.84030000000000005,"99916","Iowa",null,"IA","Davis",null,null,"Cass"]
["Decatur, IA",0.84030000000000005,"99916","Iowa",null,"IA","Decatur",null,null,"Champaign"]
["Delaware, IA",0.84030000000000005,"99916","Iowa",null,"IA","Delaware",null,null,"Christian"]
["Des Moines, IA",0.84030000000000005,"99916","Iowa",null,"IA","Des Moines",null,null,"Clinton"]
["Dickinson, IA",0.84030000000000005,"99916","Iowa",null,"IA","Dickinson",null,null,"Coles"]
["Dubuque, IA",0.86080000000000001,"20220","Dubuque, IA",null,"IA","Dubuque",null,null,"Cumberland"]
["Emmet, IA",0.84030000000000005,"99916","Iowa",null,"IA","Emmet",null,null,"De Witt"]
["Fayette, IA",0.84030000000000005,"99916","Iowa",null,"IA","Fayette",null,null,"Du Page"]
["Floyd, IA",0.84030000000000005,"99916","Iowa",null,"IA","Floyd",null,null,"Edgar"]
["Franklin, IA",0.84030000000000005,"99916","Iowa",null,"IA","Franklin",null,null,"Edwards"]
["Fremont, IA",0.84030000000000005,"99916","Iowa",null,"IA","Fremont",null,null,"Ford"]
["Greene, IA",0.84030000000000005,"99916","Iowa",null,"IA","Greene",null,null,"Gallatin"]
["Grundy, IA",0.78900000000000003,"47940","Waterloo-Cedar Falls, IA",null,"IA","Grundy",null,null,"Grundy"]
["Guthrie, IA",0.88890000000000002,"19780","Des Moines-West Des Moines, IA",null,"IA","Guthrie",null,null,"Hardin"]
["Hamilton, IA",0.84030000000000005,"99916","Iowa",null,"IA","Hamilton",null,null,"Henderson"]
["Hancock, IA",0.84030000000000005,"99916","Iowa",null,"IA","Hancock",null,null,"Iroquois"]
["Hardin, IA",0.84030000000000005,"99916","Iowa",null,"IA","Hardin",null,null,"Jersey"]
["Harrison, IA",0.95050000000000001,"36540","Omaha-Council Bluffs, NE-IA",null,"IA","Harrison",null,null,"Jo Daviess"]
["Henry, IA",0.84030000000000005,"99916","Iowa",null,"IA","Henry",null,null,"Kane"]
["Howard, IA",0.84030000000000005,"99916","Iowa",null,"IA","Howard",null,null,"Kankakee"]
["Humboldt, IA",0.84030000000000005,"99916","Iowa",null,"IA","Humboldt",null,null,"Kendall"]
["Ida, IA",0.84030000000000005,"99916","Iowa",null,"IA","Ida",null,null,"Knox"]
["Iowa, IA",0.84030000000000005,"99916","Iowa",null,"IA","Iowa",null,null,"La Salle"]
["Jackson, IA",0.84030000000000005,"99916","Iowa",null,"IA","Jackson",null,null,"Livingston"]
["Jasper, IA",0.88890000000000002,"19780","Des Moines-West Des Moines, IA",null,"IA","Jasper",null,null,"Mc Donough"]
["Jefferson, IA",0.84030000000000005,"99916","Iowa",null,"IA","Jefferson",null,null,"Mc Henry"]
["Johnson, IA",0.9819,"26980","Iowa City, IA",null,"IA","Johnson",null,null,"Mc Lean"]
["Jones, IA",0.86240000000000006,"16300","Cedar Rapids, IA",null,"IA","Jones",null,null,"Macoupin"]
["Keokuk, IA",0.84030000000000005,"99916","Iowa",null,"IA","Keokuk",null,null,"Mason"]
["Kossuth, IA",0.84030000000000005,"99916","Iowa",null,"IA","Kossuth",null,null,"Massac"]
["Lee, IA",0.84030000000000005,"99916","Iowa",null,"IA","Lee",null,null,"Menard"]
["Linn, IA",0.86240000000000006,"16300","Cedar Rapids, IA",null,"IA","Linn",null,null,"Mercer"]
["Louisa, IA",0.84030000000000005,"99916","Iowa",null,"IA","Louisa",null,null,"Moultrie"]
["Lucas, IA",0.84030000000000005,"99916","Iowa",null,"IA","Lucas",null,null,"Ogle"]
["Lyon, IA",0.84030000000000005,"99916","Iowa",null,"IA","Lyon",null,null,"Peoria"]
["Madison, IA",0.88890000000000002,"19780","Des Moines-West Des Moines, IA",null,"IA","Madison",null,null,"Piatt"]
["Mahaska, IA",0.84030000000000005,"99916","Iowa",null,"IA","Mahaska",null,null,"Richland"]
["Marion, IA",0.84030000000000005,"99916","Iowa",null,"IA","Marion",null,null,"Rock Island"]
["Marshall, IA",0.84030000000000005,"99916","Iowa",null,"IA","Marshall",null,null,"Sangamon"]
["Mills, IA",0.95050000000000001,"36540","Omaha-Council Bluffs, NE-IA",null,"IA","Mills",null,null,"Schuyler"]
["Mitchell, IA",0.84030000000000005,"99916","Iowa",null,"IA","Mitchell",null,null,"Stark"]
["Monona, IA",0.84030000000000005,"99916","Iowa",null,"IA","Monona",null,null,"Stephenson"]
["Monroe, IA",0.84030000000000005,"99916","Iowa",null,"IA","Monroe",null,null,"Tazewell"]
["Montgomery, IA",0.84030000000000005,"99916","Iowa",null,"IA","Montgomery",null,null,"Vermilion"]
["Muscatine, IA",0.84030000000000005,"99916","Iowa",null,"IA","Muscatine",null,null,"Wabash"]
["Obrien, IA",0.84030000000000005,"99916","Iowa",null,"IA","Obrien",null,null,"Whiteside"]
["Osceola, IA",0.84030000000000005,"99916","Iowa",null,"IA","Osceola",null,null,"Will"]
["Page, IA",0.84030000000000005,"99916","Iowa",null,"IA","Page",null,null,"Williamson"]
["Palo Alto, IA",0.84030000000000005,"99916","Iowa",null,"IA","Palo Alto",null,null,"Winnebago"]
["Plymouth, IA",0.84030000000000005,"99916","Iowa",null,"IA","Plymouth",null,null,"Woodford"]
["Pocahontas, IA",0.84030000000000005,"99916","Iowa",null,"IA","Pocahontas",null,"IN","Clay"]
["Polk, IA",0.88890000000000002,"19780","Des Moines-West Des Moines, IA",null,"IA","Polk",null,null,"De Kalb"]
["Pottawattamie, IA",0.95050000000000001,"36540","Omaha-Council Bluffs, NE-IA",null,"IA","Pottawattamie",null,null,"Fayette"]
["Poweshiek, IA",0.84030000000000005,"99916","Iowa",null,"IA","Poweshiek",null,null,"Franklin"]
["Ringgold, IA",0.84030000000000005,"99916","Iowa",null,"IA","Ringgold",null,null,"Greene"]
["Sac, IA",0.84030000000000005,"99916","Iowa",null,"IA","Sac",null,null,"Henry"]
["Scott, IA",0.86060000000000003,"19340","Davenport-Moline-Rock Island, IA-IL",null,"IA","Scott",null,null,"Jackson"]
["Shelby, IA",0.84030000000000005,"99916","Iowa",null,"IA","Shelby",null,null,"Jefferson"]
["Sioux, IA",0.84030000000000005,"99916","Iowa",null,"IA","Sioux",null,null,"Lawrence"]
["Story, IA",0.9214,"11180","Ames, IA",null,"IA","Story",null,null,"Madison"]
["Tama, IA",0.84030000000000005,"99916","Iowa",null,"IA","Tama",null,null,"Marion"]
["Taylor, IA",0.84030000000000005,"99916","Iowa",null,"IA","Taylor",null,null,"Marshall"]
["Union, IA",0.84030000000000005,"99916","Iowa",null,"IA","Union",null,null,"Monroe"]
["Van Buren, IA",0.84030000000000005,"99916","Iowa",null,"IA","Van Buren",null,null,"Montgomery"]
["Wapello, IA",0.84030000000000005,"99916","Iowa",null,"IA","Wapello",null,null,"Morgan"]
["Warren, IA",0.88890000000000002,"19780","Des Moines-West Des Moines, IA",null,"IA","Warren",null,null,"Perry"]
["Washington, IA",0.9819,"26980","Iowa City, IA",null,"IA","Washington",null,null,"Pike"]
["Wayne, IA",0.84030000000000005,"99916","Iowa",null,"IA","Wayne",null,null,"Randolph"]
["Webster, IA",0.84030000000000005,"99916","Iowa",null,"IA","Webster",null,null,"Shelby"]
["Winnebago, IA",0.84030000000000005,"99916","Iowa",null,"IA","Winnebago",null,null,"Washington"]
["Winneshiek, IA",0.84030000000000005,"99916","Iowa",null,"IA","Winneshiek",null,null,"Benton"]
["Woodbury, IA",0.84399999999999997,"43580","Sioux City, IA-NE-SD",null,"IA","Woodbury",null,null,"Boone"]
["Worth, IA",0.84030000000000005,"99916","Iowa",null,"IA","Worth",null,null,"Carroll"]
["Wright, IA",0.84030000000000005,"99916","Iowa",null,"IA","Wright",null,null,"Clark"]
["Allen, KS",0.77759999999999996,"99917","Kansas",null,"KS","Allen",null,null,"Crawford"]
["Anderson, KS",0.77759999999999996,"99917","Kansas",null,"KS","Anderson",null,null,"Fulton"]
["Atchison, KS",0.77759999999999996,"99917","Kansas",null,"KS","Atchison",null,null,"Grant"]
["Barber, KS",0.77759999999999996,"99917","Kansas",null,"KS","Barber",null,null,"Howard"]
["Barton, KS",0.77759999999999996,"99917","Kansas",null,"KS","Barton",null,null,"Johnson"]
["Bourbon, KS",0.77759999999999996,"99917","Kansas",null,"KS","Bourbon",null,null,"Newton"]
["Brown, KS",0.77759999999999996,"99917","Kansas",null,"KS","Brown",null,null,"Pulaski"]
["Butler, KS",0.85,"48620","Wichita, KS",null,"KS","Butler",null,null,"Scott"]
["Chase, KS",0.77759999999999996,"99917","Kansas",null,"KS","Chase",null,null,"Union"]
["Chautauqua, KS",0.77759999999999996,"99917","Kansas",null,"KS","Chautauqua",null,null,"White"]
["Cherokee, KS",0.77759999999999996,"99917","Kansas",null,"KS","Cherokee",null,null,"Lake"]
["Cheyenne, KS",0.77759999999999996,"99917","Kansas",null,"KS","Cheyenne",null,null,"Orange"]
["Clark, KS",0.77759999999999996,"99917","Kansas",null,"KS","Clark",null,null,"Adams"]
["Clay, KS",0.77759999999999996,"99917","Kansas",null,"KS","Clay",null,null,"Hamilton"]
["Cloud, KS",0.77759999999999996,"99917","Kansas",null,"KS","Cloud",null,null,"Martin"]
["Coffey, KS",0.77759999999999996,"99917","Kansas",null,"KS","Coffey",null,null,"Putnam"]
["Comanche, KS",0.77759999999999996,"99917","Kansas",null,"KS","Comanche",null,null,"Decatur"]
["Cowley, KS",0.77759999999999996,"99917","Kansas",null,"KS","Cowley",null,null,"Floyd"]
["Crawford, KS",0.77759999999999996,"99917","Kansas",null,"KS","Crawford",null,null,"Hancock"]
["Decatur, KS",0.77759999999999996,"99917","Kansas",null,"KS","Decatur",null,null,"Jasper"]
["Dickinson, KS",0.77759999999999996,"99917","Kansas",null,"KS","Dickinson",null,null,"Warren"]
["Doniphan, KS",0.94720000000000004,"41140","St. Joseph, MO-KS",null,"KS","Doniphan",null,null,"Wayne"]
["Douglas, KS",0.86280000000000001,"29940","Lawrence, KS",null,"KS","Douglas",null,null,"Brown"]
["Edwards, KS",0.77759999999999996,"99917","Kansas",null,"KS","Edwards",null,null,"Cass"]
["Elk, KS",0.77759999999999996,"99917","Kansas",null,"KS","Elk",null,null,"Clinton"]
["Ellis, KS",0.77759999999999996,"99917","Kansas",null,"KS","Ellis",null,null,"Knox"]
["Ellsworth, KS",0.77759999999999996,"99917","Kansas",null,"KS","Ellsworth",null,null,"Wabash"]
["Finney, KS",0.77759999999999996,"99917","Kansas",null,"KS","Finney",null,null,"Allen"]
["Ford, KS",0.77759999999999996,"99917","Kansas",null,"KS","Ford",null,null,"Bartholomew"]
["Franklin, KS",0.77759999999999996,"99917","Kansas",null,"KS","Franklin",null,null,"Blackford"]
["Geary, KS",0.8175,"31740","Manhattan, KS",null,"KS","Geary",null,null,"Daviess"]
["Gove, KS",0.77759999999999996,"99917","Kansas",null,"KS","Gove",null,null,"Dearborn"]
["Graham, KS",0.77759999999999996,"99917","Kansas",null,"KS","Graham",null,null,"Delaware"]
["Grant, KS",0.77759999999999996,"99917","Kansas",null,"KS","Grant",null,null,"Dubois"]
["Gray, KS",0.77759999999999996,"99917","Kansas",null,"KS","Gray",null,null,"Elkhart"]
["Greeley, KS",0.77759999999999996,"99917","Kansas",null,"KS","Greeley",null,null,"Fountain"]
["Greenwood, KS",0.77759999999999996,"99917","Kansas",null,"KS","Greenwood",null,null,"Gibson"]
["Hamilton, KS",0.77759999999999996,"99917","Kansas",null,"KS","Hamilton",null,null,"Harrison"]
["Harper, KS",0.77759999999999996,"99917","Kansas",null,"KS","Harper",null,null,"Hendricks"]
["Harvey, KS",0.85,"48620","Wichita, KS",null,"KS","Harvey",null,null,"Huntington"]
["Haskell, KS",0.77759999999999996,"99917","Kansas",null,"KS","Haskell",null,null,"Jay"]
["Hodgeman, KS",0.77759999999999996,"99917","Kansas",null,"KS","Hodgeman",null,null,"Jennings"]
["Jackson, KS",0.86719999999999997,"45820","Topeka, KS",null,"KS","Jackson",null,null,"Kosciusko"]
["Jefferson, KS",0.86719999999999997,"45820","Topeka, KS",null,"KS","Jefferson",null,null,"Lagrange"]
["Jewell, KS",0.77759999999999996,"99917","Kansas",null,"KS","Jewell",null,null,"La Porte"]
["Johnson, KS",0.91249999999999998,"28140","Kansas City, MO-KS",null,"KS","Johnson",null,null,"Miami"]
["Kearny, KS",0.77759999999999996,"99917","Kansas",null,"KS","Kearny",null,null,"Noble"]
["Kingman, KS",0.81220000000000003,"99917","Kansas",null,"KS","Kingman",null,null,"Ohio"]
["Kiowa, KS",0.77759999999999996,"99917","Kansas",null,"KS","Kiowa",null,null,"Owen"]
["Labette, KS",0.77759999999999996,"99917","Kansas",null,"KS","Labette",null,null,"Parke"]
["Lane, KS",0.77759999999999996,"99917","Kansas",null,"KS","Lane",null,null,"Porter"]
["Leavenworth, KS",0.91249999999999998,"28140","Kansas City, MO-KS",null,"KS","Leavenworth",null,null,"Posey"]
["Lincoln, KS",0.77759999999999996,"99917","Kansas",null,"KS","Lincoln",null,null,"Ripley"]
["Linn, KS",0.91249999999999998,"28140","Kansas City, MO-KS",null,"KS","Linn",null,null,"Rush"]
["Logan, KS",0.77759999999999996,"99917","Kansas",null,"KS","Logan",null,null,"St. Joseph"]
["Lyon, KS",0.77759999999999996,"99917","Kansas",null,"KS","Lyon",null,null,"Spencer"]
["Mcpherson, KS",0.77759999999999996,"99917","Kansas",null,"KS","Mcpherson",null,null,"Starke"]
["Marion, KS",0.77759999999999996,"99917","Kansas",null,"KS","Marion",null,null,"Steuben"]
["Marshall, KS",0.77759999999999996,"99917","Kansas",null,"KS","Marshall",null,null,"Sullivan"]
["Meade, KS",0.77759999999999996,"99917","Kansas",null,"KS","Meade",null,null,"Switzerland"]
["Miami, KS",0.91249999999999998,"28140","Kansas City, MO-KS",null,"KS","Miami",null,null,"Tippecanoe"]
["Mitchell, KS",0.77759999999999996,"99917","Kansas",null,"KS","Mitchell",null,null,"Tipton"]
["Montgomery, KS",0.77759999999999996,"99917","Kansas",null,"KS","Montgomery",null,null,"Vanderburgh"]
["Morris, KS",0.77759999999999996,"99917","Kansas",null,"KS","Morris",null,null,"Vermillion"]
["Morton, KS",0.77759999999999996,"99917","Kansas",null,"KS","Morton",null,null,"Vigo"]
["Nemaha, KS",0.77759999999999996,"99917","Kansas",null,"KS","Nemaha",null,null,"Warrick"]
["Neosho, KS",0.77759999999999996,"99917","Kansas",null,"KS","Neosho",null,null,"Wells"]
["Ness, KS",0.77759999999999996,"99917","Kansas",null,"KS","Ness",null,null,"Whitley"]
["Norton, KS",0.77759999999999996,"99917","Kansas",null,"KS","Norton",null,"MS","Calhoun"]
["Osage, KS",0.86719999999999997,"45820","Topeka, KS",null,"KS","Osage",null,null,"Choctaw"]
["Osborne, KS",0.77759999999999996,"99917","Kansas",null,"KS","Osborne",null,null,"Clarke"]
["Ottawa, KS",0.77759999999999996,"99917","Kansas",null,"KS","Ottawa",null,null,"Clay"]
["Pawnee, KS",0.77759999999999996,"99917","Kansas",null,"KS","Pawnee",null,null,"Covington"]
["Phillips, KS",0.77759999999999996,"99917","Kansas",null,"KS","Phillips",null,null,"Franklin"]
["Pottawatomie, KS",0.872,"31740","Manhattan, KS",null,"KS","Pottawatomie",null,null,"Greene"]
["Pratt, KS",0.77759999999999996,"99917","Kansas",null,"KS","Pratt",null,null,"Jackson"]
["Rawlins, KS",0.77759999999999996,"99917","Kansas",null,"KS","Rawlins",null,null,"Jefferson"]
["Reno, KS",0.77759999999999996,"99917","Kansas",null,"KS","Reno",null,null,"Lamar"]
["Republic, KS",0.77759999999999996,"99917","Kansas",null,"KS","Republic",null,null,"Lauderdale"]
["Rice, KS",0.77759999999999996,"99917","Kansas",null,"KS","Rice",null,null,"Lawrence"]
["Riley, KS",0.872,"31740","Manhattan, KS",null,"KS","Riley",null,null,"Lee"]
["Rooks, KS",0.77759999999999996,"99917","Kansas",null,"KS","Rooks",null,null,"Lowndes"]
["Rush, KS",0.77759999999999996,"99917","Kansas",null,"KS","Rush",null,null,"Madison"]
["Russell, KS",0.77759999999999996,"99917","Kansas",null,"KS","Russell",null,null,"Marion"]
["Saline, KS",0.77759999999999996,"99917","Kansas",null,"KS","Saline",null,null,"Marshall"]
["Scott, KS",0.77759999999999996,"99917","Kansas",null,"KS","Scott",null,null,"Monroe"]
["Sedgwick, KS",0.85,"48620","Wichita, KS",null,"KS","Sedgwick",null,null,"Montgomery"]
["Seward, KS",0.77759999999999996,"99917","Kansas",null,"KS","Seward",null,null,"Perry"]
["Shawnee, KS",0.86719999999999997,"45820","Topeka, KS",null,"KS","Shawnee",null,null,"Pike"]
["Sheridan, KS",0.77759999999999996,"99917","Kansas",null,"KS","Sheridan",null,null,"Washington"]
["Sherman, KS",0.77759999999999996,"99917","Kansas",null,"KS","Sherman",null,null,"Winston"]
["Smith, KS",0.77759999999999996,"99917","Kansas",null,"KS","Smith",null,null,"Benton"]
["Stafford, KS",0.77759999999999996,"99917","Kansas",null,"KS","Stafford",null,null,"Carroll"]
["Stanton, KS",0.77759999999999996,"99917","Kansas",null,"KS","Stanton",null,null,"Lafayette"]
["Stevens, KS",0.77759999999999996,"99917","Kansas",null,"KS","Stevens",null,null,"Lincoln"]
["Sumner, KS",0.85,"48620","Wichita, KS",null,"KS","Sumner",null,null,"Newton"]
["Thomas, KS",0.77759999999999996,"99917","Kansas",null,"KS","Thomas",null,null,"Scott"]
["Trego, KS",0.77759999999999996,"99917","Kansas",null,"KS","Trego",null,null,"Stone"]
["Wabaunsee, KS",0.86719999999999997,"45820","Topeka, KS",null,"KS","Wabaunsee",null,null,"Union"]
["Wallace, KS",0.77759999999999996,"99917","Kansas",null,"KS","Wallace",null,null,"Adams"]
["Washington, KS",0.77759999999999996,"99917","Kansas",null,"KS","Washington",null,null,"De Soto"]
["Wichita, KS",0.77759999999999996,"99917","Kansas",null,"KS","Wichita",null,null,"Holmes"]
["Wilson, KS",0.77759999999999996,"99917","Kansas",null,"KS","Wilson",null,null,"Hancock"]
["Woodson, KS",0.77759999999999996,"99917","Kansas",null,"KS","Woodson",null,null,"Jasper"]
["Wyandotte, KS",0.91249999999999998,"28140","Kansas City, MO-KS",null,"KS","Wyandotte",null,null,"Jones"]
["Adair, KY",0.79149999999999998,"99918","Kentucky",null,"KY","Adair",null,null,"Quitman"]
["Allen, KY",0.84399999999999997,"14540","Bowling Green, KY",null,"KY","Allen",null,null,"Warren"]
["Anderson, KY",0.79149999999999998,"99918","Kentucky",null,"KY","Anderson",null,null,"Wayne"]
["Ballard, KY",0.79149999999999998,"99918","Kentucky",null,"KY","Ballard",null,null,"Webster"]
["Barren, KY",0.79149999999999998,"99918","Kentucky",null,"KY","Barren",null,null,"Wilkinson"]
["Bath, KY",0.79149999999999998,"99918","Kentucky",null,"KY","Bath",null,null,"Harrison"]
["Bell, KY",0.79149999999999998,"99918","Kentucky",null,"KY","Bell",null,null,"Chickasaw"]
["Boone, KY",0.94610000000000005,"17140","Cincinnati, OH-KY-IN",null,"KY","Boone",null,null,"Smith"]
["Bourbon, KY",0.88490000000000002,"30460","Lexington-Fayette, KY",null,"KY","Bourbon",null,null,"Simpson"]
["Boyd, KY",0.85050000000000003,"26580","Huntington-Ashland, WV-KY-OH",null,"KY","Boyd",null,null,"Claiborne"]
["Boyle, KY",0.79149999999999998,"99918","Kentucky",null,"KY","Boyle",null,null,"Alcorn"]
["Bracken, KY",0.94610000000000005,"17140","Cincinnati, OH-KY-IN",null,"KY","Bracken",null,null,"Amite"]
["Breathitt, KY",0.79149999999999998,"99918","Kentucky",null,"KY","Breathitt",null,null,"Attala"]
["Breckinridge, KY",0.79149999999999998,"99918","Kentucky",null,"KY","Breckinridge",null,null,"Bolivar"]
["Bullitt, KY",0.86970000000000003,"31140","Louisville/Jefferson County, KY-IN",null,"KY","Bullitt",null,null,"Coahoma"]
["Butler, KY",0.84399999999999997,"14540","Bowling Green, KY",null,"KY","Butler",null,null,"Copiah"]
["Caldwell, KY",0.79149999999999998,"99918","Kentucky",null,"KY","Caldwell",null,null,"Forrest"]
["Calloway, KY",0.79149999999999998,"99918","Kentucky",null,"KY","Calloway",null,null,"George"]
["Campbell, KY",0.94610000000000005,"17140","Cincinnati, OH-KY-IN",null,"KY","Campbell",null,null,"Grenada"]
["Carlisle, KY",0.79149999999999998,"99918","Kentucky",null,"KY","Carlisle",null,null,"Hinds"]
["Carroll, KY",0.79149999999999998,"99918","Kentucky",null,"KY","Carroll",null,null,"Humphreys"]
["Carter, KY",0.85050000000000003,"26580","Huntington-Ashland, WV-KY-OH",null,"KY","Carter",null,null,"Issaquena"]
["Casey, KY",0.79149999999999998,"99918","Kentucky",null,"KY","Casey",null,null,"Itawamba"]
["Christian, KY",0.748,"17300","Clarksville, TN-KY",null,"KY","Christian",null,null,"Jefferson Davis"]
["Clark, KY",0.88490000000000002,"30460","Lexington-Fayette, KY",null,"KY","Clark",null,null,"Kemper"]
["Clay, KY",0.79149999999999998,"99918","Kentucky",null,"KY","Clay",null,null,"Leake"]
["Clinton, KY",0.79149999999999998,"99918","Kentucky",null,"KY","Clinton",null,null,"Leflore"]
["Crittenden, KY",0.79149999999999998,"99918","Kentucky",null,"KY","Crittenden",null,null,"Neshoba"]
["Cumberland, KY",0.79149999999999998,"99918","Kentucky",null,"KY","Cumberland",null,null,"Noxubee"]
["Daviess, KY",0.85350000000000004,"36980","Owensboro, KY",null,"KY","Daviess",null,null,"Oktibbeha"]
["Edmonson, KY",0.84399999999999997,"14540","Bowling Green, KY",null,"KY","Edmonson",null,null,"Panola"]
["Elliott, KY",0.79149999999999998,"99918","Kentucky",null,"KY","Elliott",null,null,"Pearl River"]
["Estill, KY",0.79149999999999998,"99918","Kentucky",null,"KY","Estill",null,null,"Pontotoc"]
["Fayette, KY",0.88490000000000002,"30460","Lexington-Fayette, KY",null,"KY","Fayette",null,null,"Prentiss"]
["Fleming, KY",0.79149999999999998,"99918","Kentucky",null,"KY","Fleming",null,null,"Rankin"]
["Floyd, KY",0.79149999999999998,"99918","Kentucky",null,"KY","Floyd",null,null,"Sharkey"]
["Franklin, KY",0.79149999999999998,"99918","Kentucky",null,"KY","Franklin",null,null,"Sunflower"]
["Fulton, KY",0.79149999999999998,"99918","Kentucky",null,"KY","Fulton",null,null,"Tallahatchie"]
["Gallatin, KY",0.94610000000000005,"17140","Cincinnati, OH-KY-IN",null,"KY","Gallatin",null,null,"Tate"]
["Garrard, KY",0.79149999999999998,"99918","Kentucky",null,"KY","Garrard",null,null,"Tippah"]
["Grant, KY",0.94610000000000005,"17140","Cincinnati, OH-KY-IN",null,"KY","Grant",null,null,"Tishomingo"]
["Graves, KY",0.79149999999999998,"99918","Kentucky",null,"KY","Graves",null,null,"Tunica"]
["Grayson, KY",0.79149999999999998,"99918","Kentucky",null,"KY","Grayson",null,null,"Walthall"]
["Green, KY",0.79149999999999998,"99918","Kentucky",null,"KY","Green",null,null,"Yalobusha"]
["Greenup, KY",0.85050000000000003,"26580","Huntington-Ashland, WV-KY-OH",null,"KY","Greenup",null,null,"Yazoo"]
["Hancock, KY",0.85350000000000004,"36980","Owensboro, KY",null,"KY","Hancock",null,"ND","Grant"]
["Hardin, KY",0.76559999999999995,"21060","Elizabethtown-Fort Knox, KY",null,"KY","Hardin",null,null,"Logan"]
["Harlan, KY",0.79149999999999998,"99918","Kentucky",null,"KY","Harlan",null,null,"Adams"]
["Harrison, KY",0.79149999999999998,"99918","Kentucky",null,"KY","Harrison",null,null,"Burke"]
["Hart, KY",0.79149999999999998,"99918","Kentucky",null,"KY","Hart",null,null,"Pierce"]
["Henderson, KY",0.92559999999999998,"21780","Evansville, IN-KY",null,"KY","Henderson",null,null,"Cass"]
["Henry, KY",0.86970000000000003,"31140","Louisville/Jefferson County, KY-IN",null,"KY","Henry",null,null,"Mercer"]
["Hickman, KY",0.79149999999999998,"99918","Kentucky",null,"KY","Hickman",null,null,"Richland"]
["Hopkins, KY",0.79149999999999998,"99918","Kentucky",null,"KY","Hopkins",null,null,"Stark"]
["Jackson, KY",0.79149999999999998,"99918","Kentucky",null,"KY","Jackson",null,null,"Wells"]
["Jefferson, KY",0.86970000000000003,"31140","Louisville/Jefferson County, KY-IN",null,"KY","Jefferson",null,null,"Sioux"]
["Jessamine, KY",0.88490000000000002,"30460","Lexington-Fayette, KY",null,"KY","Jessamine",null,null,"Morton"]
["Johnson, KY",0.79149999999999998,"99918","Kentucky",null,"KY","Johnson",null,null,"Sheridan"]
["Kenton, KY",0.94610000000000005,"17140","Cincinnati, OH-KY-IN",null,"KY","Kenton",null,null,"Nelson"]
["Knott, KY",0.79149999999999998,"99918","Kentucky",null,"KY","Knott",null,null,"Ramsey"]
["Knox, KY",0.79149999999999998,"99918","Kentucky",null,"KY","Knox",null,null,"Renville"]
["Larue, KY",0.76559999999999995,"21060","Elizabethtown-Fort Knox, KY",null,"KY","Larue",null,null,"Steele"]
["Laurel, KY",0.79149999999999998,"99918","Kentucky",null,"KY","Laurel",null,null,"Golden Valley"]
["Lawrence, KY",0.79149999999999998,"99918","Kentucky",null,"KY","Lawrence",null,null,"Eddy"]
["Lee, KY",0.79149999999999998,"99918","Kentucky",null,"KY","Lee",null,null,"Barnes"]
["Leslie, KY",0.79149999999999998,"99918","Kentucky",null,"KY","Leslie",null,null,"Benson"]
["Letcher, KY",0.79149999999999998,"99918","Kentucky",null,"KY","Letcher",null,null,"Billings"]
["Lewis, KY",0.79149999999999998,"99918","Kentucky",null,"KY","Lewis",null,null,"Bottineau"]
["Lincoln, KY",0.79149999999999998,"99918","Kentucky",null,"KY","Lincoln",null,null,"Bowman"]
["Livingston, KY",0.79149999999999998,"99918","Kentucky",null,"KY","Livingston",null,null,"Burleigh"]
["Logan, KY",0.79149999999999998,"99918","Kentucky",null,"KY","Logan",null,null,"Cavalier"]
["Lyon, KY",0.79149999999999998,"99918","Kentucky",null,"KY","Lyon",null,null,"Dickey"]
["Mc Cracken, KY",0.79149999999999998,"99918","Kentucky",null,"KY","Mc Cracken",null,null,"Divide"]
["Mc Creary, KY",0.79149999999999998,"99918","Kentucky",null,"KY","Mc Creary",null,null,"Dunn"]
["Mc Lean, KY",0.85350000000000004,"36980","Owensboro, KY",null,"KY","Mc Lean",null,null,"Emmons"]
["Madison, KY",0.79149999999999998,"99918","Kentucky",null,"KY","Madison",null,null,"Foster"]
["Magoffin, KY",0.79149999999999998,"99918","Kentucky",null,"KY","Magoffin",null,null,"Grand Forks"]
["Marion, KY",0.79149999999999998,"99918","Kentucky",null,"KY","Marion",null,null,"Griggs"]
["Marshall, KY",0.79149999999999998,"99918","Kentucky",null,"KY","Marshall",null,null,"Hettinger"]
["Martin, KY",0.79149999999999998,"99918","Kentucky",null,"KY","Martin",null,null,"Kidder"]
["Mason, KY",0.79149999999999998,"99918","Kentucky",null,"KY","Mason",null,null,"La Moure"]
["Meade, KY",0.76559999999999995,"21060","Elizabethtown-Fort Knox, KY",null,"KY","Meade",null,null,"Mchenry"]
["Menifee, KY",0.79149999999999998,"99918","Kentucky",null,"KY","Menifee",null,null,"Mcintosh"]
["Mercer, KY",0.79149999999999998,"99918","Kentucky",null,"KY","Mercer",null,null,"Mckenzie"]
["Metcalfe, KY",0.79149999999999998,"99918","Kentucky",null,"KY","Metcalfe",null,null,"Mclean"]
["Monroe, KY",0.79149999999999998,"99918","Kentucky",null,"KY","Monroe",null,null,"Mountrail"]
["Montgomery, KY",0.79149999999999998,"99918","Kentucky",null,"KY","Montgomery",null,null,"Oliver"]
["Morgan, KY",0.79149999999999998,"99918","Kentucky",null,"KY","Morgan",null,null,"Pembina"]
["Muhlenberg, KY",0.79149999999999998,"99918","Kentucky",null,"KY","Muhlenberg",null,null,"Ransom"]
["Nelson, KY",0.79149999999999998,"99918","Kentucky",null,"KY","Nelson",null,null,"Rolette"]
["Nicholas, KY",0.79149999999999998,"99918","Kentucky",null,"KY","Nicholas",null,null,"Sargent"]
["Ohio, KY",0.79149999999999998,"99918","Kentucky",null,"KY","Ohio",null,null,"Slope"]
["Oldham, KY",0.86970000000000003,"31140","Louisville/Jefferson County, KY-IN",null,"KY","Oldham",null,null,"Stutsman"]
["Owen, KY",0.79149999999999998,"99918","Kentucky",null,"KY","Owen",null,null,"Towner"]
["Owsley, KY",0.79149999999999998,"99918","Kentucky",null,"KY","Owsley",null,null,"Traill"]
["Pendleton, KY",0.94610000000000005,"17140","Cincinnati, OH-KY-IN",null,"KY","Pendleton",null,null,"Walsh"]
["Perry, KY",0.79149999999999998,"99918","Kentucky",null,"KY","Perry",null,null,"Ward"]
["Pike, KY",0.79149999999999998,"99918","Kentucky",null,"KY","Pike",null,null,"Williams"]
["Powell, KY",0.79149999999999998,"99918","Kentucky",null,"KY","Powell",null,"NE","Butler"]
["Pulaski, KY",0.79149999999999998,"99918","Kentucky",null,"KY","Pulaski",null,null,"Clay"]
["Robertson, KY",0.79149999999999998,"99918","Kentucky",null,"KY","Robertson",null,null,"Franklin"]
["Rockcastle, KY",0.79149999999999998,"99918","Kentucky",null,"KY","Rockcastle",null,null,"Jefferson"]
["Rowan, KY",0.79149999999999998,"99918","Kentucky",null,"KY","Rowan",null,null,"Madison"]
["Russell, KY",0.79149999999999998,"99918","Kentucky",null,"KY","Russell",null,null,"Washington"]
["Scott, KY",0.88490000000000002,"30460","Lexington-Fayette, KY",null,"KY","Scott",null,null,"Boone"]
["Shelby, KY",0.86970000000000003,"31140","Louisville/Jefferson County, KY-IN",null,"KY","Shelby",null,null,"Grant"]
["Simpson, KY",0.79149999999999998,"99918","Kentucky",null,"KY","Simpson",null,null,"Howard"]
["Spencer, KY",0.86970000000000003,"31140","Louisville/Jefferson County, KY-IN",null,"KY","Spencer",null,null,"Johnson"]
["Taylor, KY",0.79149999999999998,"99918","Kentucky",null,"KY","Taylor",null,null,"Lincoln"]
["Todd, KY",0.79149999999999998,"99918","Kentucky",null,"KY","Todd",null,null,"Logan"]
["Trigg, KY",0.748,"17300","Clarksville, TN-KY",null,"KY","Trigg",null,null,"Polk"]
["Trimble, KY",0.84019999999999995,"99918","Kentucky",null,"KY","Trimble",null,null,"Saline"]
["Union, KY",0.79149999999999998,"99918","Kentucky",null,"KY","Union",null,null,"Adams"]
["Warren, KY",0.84399999999999997,"14540","Bowling Green, KY",null,"KY","Warren",null,null,"Cheyenne"]
["Washington, KY",0.79149999999999998,"99918","Kentucky",null,"KY","Washington",null,null,"Custer"]
["Wayne, KY",0.79149999999999998,"99918","Kentucky",null,"KY","Wayne",null,null,"Douglas"]
["Webster, KY",0.79149999999999998,"99918","Kentucky",null,"KY","Webster",null,null,"Garfield"]
["Whitley, KY",0.79149999999999998,"99918","Kentucky",null,"KY","Whitley",null,null,"Hamilton"]
["Wolfe, KY",0.79149999999999998,"99918","Kentucky",null,"KY","Wolfe",null,null,"Dawson"]
["Woodford, KY",0.88490000000000002,"30460","Lexington-Fayette, KY",null,"KY","Woodford",null,null,"Dodge"]
["Acadia, LA",0.76700000000000002,"29180","Lafayette, LA",null,"LA","Acadia",null,null,"Hall"]
["Allen, LA",0.69689999999999996,"99919","Louisiana",null,"LA","Allen",null,null,"Pierce"]
["Ascension, LA",0.79879999999999995,"12940","Baton Rouge, LA",null,"LA","Ascension",null,null,"Thomas"]
["Assumption, LA",0.79879999999999995,"12940","Baton Rouge, LA",null,"LA","Assumption",null,null,"Wayne"]
["Avoyelles, LA",0.69689999999999996,"99919","Louisiana",null,"LA","Avoyelles",null,null,"Webster"]
["Beauregard, LA",0.69689999999999996,"99919","Louisiana",null,"LA","Beauregard",null,null,"Wheeler"]
["Bienville, LA",0.69689999999999996,"99919","Louisiana",null,"LA","Bienville",null,null,"Blaine"]
["Bossier, LA",0.82169999999999999,"43340","Shreveport-Bossier City, LA",null,"LA","Bossier",null,null,"Valley"]
["Caddo, LA",0.82169999999999999,"43340","Shreveport-Bossier City, LA",null,"LA","Caddo",null,null,"Brown"]
["Calcasieu, LA",0.76170000000000004,"29340","Lake Charles, LA",null,"LA","Calcasieu",null,null,"Cass"]
["Caldwell, LA",0.69689999999999996,"99919","Louisiana",null,"LA","Caldwell",null,null,"Knox"]
["Cameron, LA",0.76170000000000004,"29340","Lake Charles, LA",null,"LA","Cameron",null,null,"Cedar"]
["Catahoula, LA",0.69689999999999996,"99919","Louisiana",null,"LA","Catahoula",null,null,"Sioux"]
["Claiborne, LA",0.69689999999999996,"99919","Louisiana",null,"LA","Claiborne",null,null,"Chase"]
["Concordia, LA",0.69689999999999996,"99919","Louisiana",null,"LA","Concordia",null,null,"Greeley"]
["De Soto, LA",0.82169999999999999,"43340","Shreveport-Bossier City, LA",null,"LA","De Soto",null,null,"Nemaha"]
["E. Baton Rouge, LA",0.79879999999999995,"12940","Baton Rouge, LA",null,"LA","E. Baton Rouge",null,null,"Pawnee"]
["East Carroll, LA",0.69689999999999996,"99919","Louisiana",null,"LA","East Carroll",null,null,"Seward"]
["East Feliciana, LA",0.79879999999999995,"12940","Baton Rouge, LA",null,"LA","East Feliciana",null,null,"Sheridan"]
["Evangeline, LA",0.69689999999999996,"99919","Louisiana",null,"LA","Evangeline",null,null,"Sherman"]
["Franklin, LA",0.69689999999999996,"99919","Louisiana",null,"LA","Franklin",null,null,"Stanton"]
["Grant, LA",0.85270000000000001,"10780","Alexandria, LA",null,"LA","Grant",null,null,"Boyd"]
["Iberia, LA",0.76700000000000002,"29180","Lafayette, LA",null,"LA","Iberia",null,null,"Harlan"]
["Iberville, LA",0.79879999999999995,"12940","Baton Rouge, LA",null,"LA","Iberville",null,null,"York"]
["Jackson, LA",0.69689999999999996,"99919","Louisiana",null,"LA","Jackson",null,null,"Dakota"]
["Jefferson, LA",0.8357,"35380","New Orleans-Metairie, LA",null,"LA","Jefferson",null,null,"Fillmore"]
["Jeffrson Davis, LA",0.69689999999999996,"99919","Louisiana",null,"LA","Jeffrson Davis",null,null,"Rock"]
["Lafayette, LA",0.76700000000000002,"29180","Lafayette, LA",null,"LA","Lafayette",null,null,"Holt"]
["Lafourche, LA",0.69410000000000005,"26380","Houma-Thibodaux, LA",null,"LA","Lafourche",null,null,"Phelps"]
["Lasalle, LA",0.69689999999999996,"99919","Louisiana",null,"LA","Lasalle",null,null,"Platte"]
["Lincoln, LA",0.69689999999999996,"99919","Louisiana",null,"LA","Lincoln",null,null,"Antelope"]
["Livingston, LA",0.79879999999999995,"12940","Baton Rouge, LA",null,"LA","Livingston",null,null,"Arthur"]
["Madison, LA",0.69689999999999996,"99919","Louisiana",null,"LA","Madison",null,null,"Banner"]
["Morehouse, LA",0.76829999999999998,"33740","Monroe, LA",null,"LA","Morehouse",null,null,"Box Butte"]
["Natchitoches, LA",0.69689999999999996,"99919","Louisiana",null,"LA","Natchitoches",null,null,"Buffalo"]
["Orleans, LA",0.8357,"35380","New Orleans-Metairie, LA",null,"LA","Orleans",null,null,"Burt"]
["Ouachita, LA",0.76829999999999998,"33740","Monroe, LA",null,"LA","Ouachita",null,null,"Cherry"]
["Plaquemines, LA",0.8357,"35380","New Orleans-Metairie, LA",null,"LA","Plaquemines",null,null,"Colfax"]
["Pointe Coupee, LA",0.79879999999999995,"12940","Baton Rouge, LA",null,"LA","Pointe Coupee",null,null,"Cuming"]
["Rapides, LA",0.85270000000000001,"10780","Alexandria, LA",null,"LA","Rapides",null,null,"Dawes"]
["Red River, LA",0.69689999999999996,"99919","Louisiana",null,"LA","Red River",null,null,"Deuel"]
["Richland, LA",0.69689999999999996,"99919","Louisiana",null,"LA","Richland",null,null,"Dixon"]
["Sabine, LA",0.69689999999999996,"99919","Louisiana",null,"LA","Sabine",null,null,"Dundy"]
["St. Bernard, LA",0.8357,"35380","New Orleans-Metairie, LA",null,"LA","St. Bernard",null,null,"Frontier"]
["St. Charles, LA",0.8357,"35380","New Orleans-Metairie, LA",null,"LA","St. Charles",null,null,"Furnas"]
["St. Helena, LA",0.79879999999999995,"12940","Baton Rouge, LA",null,"LA","St. Helena",null,null,"Gage"]
["St. James, LA",0.8357,"35380","New Orleans-Metairie, LA",null,"LA","St. James",null,null,"Garden"]
["St. John Baptist, LA",0.8357,"35380","New Orleans-Metairie, LA",null,"LA","St. John Baptist",null,null,"Gosper"]
["St. Landry, LA",0.69689999999999996,"99919","Louisiana",null,"LA","St. Landry",null,null,"Hayes"]
["St. Martin, LA",0.76700000000000002,"29180","Lafayette, LA",null,"LA","St. Martin",null,null,"Hitchcock"]
["St. Mary, LA",0.69689999999999996,"99919","Louisiana",null,"LA","St. Mary",null,null,"Hooker"]
["St. Tammany, LA",0.8357,"35380","New Orleans-Metairie, LA",null,"LA","St. Tammany",null,null,"Kearney"]
["Tangipahoa, LA",0.83260000000000001,"25220","Hammond, LA",null,"LA","Tangipahoa",null,null,"Keith"]
["Tensas, LA",0.69689999999999996,"99919","Louisiana",null,"LA","Tensas",null,null,"Keya Paha"]
["Terrebonne, LA",0.69410000000000005,"26380","Houma-Thibodaux, LA",null,"LA","Terrebonne",null,null,"Kimball"]
["Union, LA",0.76829999999999998,"33740","Monroe, LA",null,"LA","Union",null,null,"Lancaster"]
["Vermilion, LA",0.76700000000000002,"29180","Lafayette, LA",null,"LA","Vermilion",null,null,"Loup"]
["Vernon, LA",0.69689999999999996,"99919","Louisiana",null,"LA","Vernon",null,null,"Mc Pherson"]
["Washington, LA",0.69689999999999996,"99919","Louisiana",null,"LA","Washington",null,null,"Merrick"]
["Webster, LA",0.76449999999999996,"99919","Louisiana",null,"LA","Webster",null,null,"Morrill"]
["W. Baton Rouge, LA",0.79879999999999995,"12940","Baton Rouge, LA",null,"LA","W. Baton Rouge",null,null,"Nance"]
["West Carroll, LA",0.69689999999999996,"99919","Louisiana",null,"LA","West Carroll",null,null,"Nuckolls"]
["West Feliciana, LA",0.79879999999999995,"12940","Baton Rouge, LA",null,"LA","West Feliciana",null,null,"Otoe"]
["Winn, LA",0.69689999999999996,"99919","Louisiana",null,"LA","Winn",null,null,"Perkins"]
["Androscoggin, ME",0.87250000000000005,"30340","Lewiston-Auburn, ME",null,"ME","Androscoggin",null,null,"Red Willow"]
["Aroostook, ME",0.84360000000000002,"99920","Maine",null,"ME","Aroostook",null,null,"Richardson"]
["Cumberland, ME",1.0390999999999999,"38860","Portland-South Portland, ME",null,"ME","Cumberland",null,null,"Sarpy"]
["Franklin, ME",0.84360000000000002,"99920","Maine",null,"ME","Franklin",null,null,"Saunders"]
["Hancock, ME",0.84360000000000002,"99920","Maine",null,"ME","Hancock",null,null,"Scott Bluff"]
["Kennebec, ME",0.84360000000000002,"99920","Maine",null,"ME","Kennebec",null,null,"Thayer"]
["Knox, ME",0.84360000000000002,"99920","Maine",null,"ME","Knox",null,null,"Thurston"]
["Lincoln, ME",0.84360000000000002,"99920","Maine",null,"ME","Lincoln",null,"OH","Butler"]
["Oxford, ME",0.84360000000000002,"99920","Maine",null,"ME","Oxford",null,null,"Fayette"]
["Penobscot, ME",1.0022,"12620","Bangor, ME",null,"ME","Penobscot",null,null,"Franklin"]
["Piscataquis, ME",0.84360000000000002,"99920","Maine",null,"ME","Piscataquis",null,null,"Greene"]
["Sagadahoc, ME",1.0390999999999999,"38860","Portland-South Portland, ME",null,"ME","Sagadahoc",null,null,"Henry"]
["Somerset, ME",0.84360000000000002,"99920","Maine",null,"ME","Somerset",null,null,"Jackson"]
["Waldo, ME",0.84360000000000002,"99920","Maine",null,"ME","Waldo",null,null,"Jefferson"]
["Washington, ME",0.84360000000000002,"99920","Maine",null,"ME","Washington",null,null,"Lawrence"]
["York, ME",1.0390999999999999,"38860","Portland-South Portland, ME",null,"ME","York",null,null,"Madison"]
["Allegany, MD",0.9002,"19060","Cumberland, MD-WV",null,"MD","Allegany",null,null,"Marion"]
["Anne Arundel, MD",0.95209999999999995,"12580","Baltimore-Columbia-Towson, MD",null,"MD","Anne Arundel",null,null,"Monroe"]
["Baltimore, MD",0.95209999999999995,"12580","Baltimore-Columbia-Towson, MD",null,"MD","Baltimore",null,null,"Montgomery"]
["Baltimore City, MD",0.95209999999999995,"12580","Baltimore-Columbia-Towson, MD",null,"MD","Baltimore City",null,null,"Morgan"]
["Calvert, MD",1.0152000000000001,"47894","Washington-Arlington-Alexandria, DC-VA-MD-WV",null,"MD","Calvert",null,null,"Perry"]
["Caroline, MD",0.86260000000000003,"99921","Maryland",null,"MD","Caroline",null,null,"Pike"]
["Carroll, MD",0.95209999999999995,"12580","Baltimore-Columbia-Towson, MD",null,"MD","Carroll",null,null,"Shelby"]
["Cecil, MD",1.0928,"48864","Wilmington, DE-MD-NJ",null,"MD","Cecil",null,null,"Washington"]
["Charles, MD",1.0152000000000001,"47894","Washington-Arlington-Alexandria, DC-VA-MD-WV",null,"MD","Charles",null,null,"Carroll"]
["Dorchester, MD",0.86260000000000003,"99921","Maryland",null,"MD","Dorchester",null,null,"Clark"]
["Frederick, MD",0.98340000000000005,"23224","Frederick-Gaithersburg-Rockville, MD",null,"MD","Frederick",null,null,"Crawford"]
["Garrett, MD",0.86260000000000003,"99921","Maryland",null,"MD","Garrett",null,null,"Fulton"]
["Harford, MD",0.95209999999999995,"12580","Baltimore-Columbia-Towson, MD",null,"MD","Harford",null,null,"Logan"]
["Howard, MD",0.95209999999999995,"12580","Baltimore-Columbia-Towson, MD",null,"MD","Howard",null,null,"Union"]
["Kent, MD",0.86260000000000003,"99921","Maryland",null,"MD","Kent",null,null,"Lake"]
["Montgomery, MD",0.98340000000000005,"23224","Frederick-Gaithersburg-Rockville, MD",null,"MD","Montgomery",null,null,"Adams"]
["Prince Georges, MD",1.0152000000000001,"47894","Washington-Arlington-Alexandria, DC-VA-MD-WV",null,"MD","Prince Georges",null,null,"Summit"]
["Queen Annes, MD",0.95209999999999995,"12580","Baltimore-Columbia-Towson, MD",null,"MD","Queen Annes",null,null,"Fairfield"]
["St. Marys, MD",0.90249999999999997,"15680","California-Lexington Park, MD",null,"MD","St. Marys",null,null,"Hamilton"]
["Somerset, MD",0.92469999999999997,"41540","Salisbury, MD-DE",null,"MD","Somerset",null,null,"Holmes"]
["Talbot, MD",0.86260000000000003,"99921","Maryland",null,"MD","Talbot",null,null,"Putnam"]
["Washington, MD",0.86180000000000001,"25180","Hagerstown-Martinsburg, MD-WV",null,"MD","Washington",null,null,"Hancock"]
["Wicomico, MD",0.92469999999999997,"41540","Salisbury, MD-DE",null,"MD","Wicomico",null,null,"Paulding"]
["Worcester, MD",0.92469999999999997,"41540","Salisbury, MD-DE",null,"MD","Worcester",null,null,"Warren"]
["Barnstable, MA",1.2144999999999999,"12700","Barnstable Town, MA",null,"MA","Barnstable",null,null,"Wayne"]
["Berkshire, MA",1.0486,"38340","Pittsfield, MA",null,"MA","Berkshire",null,null,"Brown"]
["Bristol, MA",1.0189999999999999,"39300","Providence-Warwick, RI-MA",null,"MA","Bristol",null,null,"Champaign"]
["Dukes, MA",1.2928999999999999,"99922","Massachusetts",null,"MA","Dukes",null,null,"Clinton"]
["Essex, MA",1.0864,"15764","Cambridge-Newton-Framingham, MA",null,"MA","Essex",null,null,"Hardin"]
["Franklin, MA",1.0506,"44140","Springfield, MA",null,"MA","Franklin",null,null,"Knox"]
["Hampden, MA",0.99270000000000003,"44140","Springfield, MA",null,"MA","Hampden",null,null,"Mercer"]
["Hampshire, MA",0.99270000000000003,"44140","Springfield, MA",null,"MA","Hampshire",null,null,"Richland"]
["Middlesex, MA",1.0864,"15764","Cambridge-Newton-Framingham, MA",null,"MA","Middlesex",null,null,"Stark"]
["Nantucket, MA",1.2928999999999999,"99922","Massachusetts",null,"MA","Nantucket",null,null,"Allen"]
["Norfolk, MA",1.222,"14454","Boston, MA",null,"MA","Norfolk",null,null,"Delaware"]
["Plymouth, MA",1.222,"14454","Boston, MA",null,"MA","Plymouth",null,null,"Harrison"]
["Suffolk, MA",1.222,"14454","Boston, MA",null,"MA","Suffolk",null,null,"Miami"]
["Worcester, MA",1.1233,"49340","Worcester, MA-CT",null,"MA","Worcester",null,null,"Noble"]
["Alcona, MI",0.84819999999999995,"99923","Michigan",null,"MI","Alcona",null,null,"Lucas"]
["Alger, MI",0.84819999999999995,"99923","Michigan",null,"MI","Alger",null,null,"Ottawa"]
["Allegan, MI",0.84819999999999995,"99923","Michigan",null,"MI","Allegan",null,null,"Huron"]
["Alpena, MI",0.84819999999999995,"99923","Michigan",null,"MI","Alpena",null,null,"Erie"]
["Antrim, MI",0.84819999999999995,"99923","Michigan",null,"MI","Antrim",null,null,"Seneca"]
["Arenac, MI",0.84819999999999995,"99923","Michigan",null,"MI","Arenac",null,null,"Williams"]
["Baraga, MI",0.84819999999999995,"99923","Michigan",null,"MI","Baraga",null,null,"Ashland"]
["Barry, MI",0.84819999999999995,"99923","Michigan",null,"MI","Barry",null,null,"Ashtabula"]
["Bay, MI",0.92420000000000002,"13020","Bay City, MI",null,"MI","Bay",null,null,"Athens"]
["Benzie, MI",0.84819999999999995,"99923","Michigan",null,"MI","Benzie",null,null,"Auglaize"]
["Berrien, MI",0.83150000000000002,"35660","Niles, MI",null,"MI","Berrien",null,null,"Belmont"]
["Branch, MI",0.84819999999999995,"99923","Michigan",null,"MI","Branch",null,null,"Clermont"]
["Calhoun, MI",0.89859999999999995,"12980","Battle Creek, MI",null,"MI","Calhoun",null,null,"Columbiana"]
["Cass, MI",0.96750000000000003,"43780","South Bend-Mishawaka, IN-MI",null,"MI","Cass",null,null,"Coshocton"]
["Charlevoix, MI",0.84819999999999995,"99923","Michigan",null,"MI","Charlevoix",null,null,"Cuyahoga"]
["Cheboygan, MI",0.84819999999999995,"99923","Michigan",null,"MI","Cheboygan",null,null,"Darke"]
["Chippewa, MI",0.84819999999999995,"99923","Michigan",null,"MI","Chippewa",null,null,"Defiance"]
["Clare, MI",0.84819999999999995,"99923","Michigan",null,"MI","Clare",null,null,"Gallia"]
["Clinton, MI",0.94699999999999995,"29620","Lansing-East Lansing, MI",null,"MI","Clinton",null,null,"Geauga"]
["Crawford, MI",0.84819999999999995,"99923","Michigan",null,"MI","Crawford",null,null,"Guernsey"]
["Delta, MI",0.84819999999999995,"99923","Michigan",null,"MI","Delta",null,null,"Highland"]
["Dickinson, MI",0.84819999999999995,"99923","Michigan",null,"MI","Dickinson",null,null,"Hocking"]
["Eaton, MI",0.94699999999999995,"29620","Lansing-East Lansing, MI",null,"MI","Eaton",null,null,"Licking"]
["Emmet, MI",0.84819999999999995,"99923","Michigan",null,"MI","Emmet",null,null,"Lorain"]
["Genesee, MI",1.0656000000000001,"22420","Flint, MI",null,"MI","Genesee",null,null,"Mahoning"]
["Gladwin, MI",0.84819999999999995,"99923","Michigan",null,"MI","Gladwin",null,null,"Medina"]
["Gogebic, MI",0.84819999999999995,"99923","Michigan",null,"MI","Gogebic",null,null,"Meigs"]
["Grand Traverse, MI",0.84819999999999995,"99923","Michigan",null,"MI","Grand Traverse",null,null,"Morrow"]
["Gratiot, MI",0.84819999999999995,"99923","Michigan",null,"MI","Gratiot",null,null,"Muskingum"]
["Hillsdale, MI",0.84819999999999995,"99923","Michigan",null,"MI","Hillsdale",null,null,"Pickaway"]
["Houghton, MI",0.84819999999999995,"99923","Michigan",null,"MI","Houghton",null,null,"Portage"]
["Huron, MI",0.84819999999999995,"99923","Michigan",null,"MI","Huron",null,null,"Preble"]
["Ingham, MI",0.94699999999999995,"29620","Lansing-East Lansing, MI",null,"MI","Ingham",null,null,"Ross"]
["Ionia, MI",0.91979999999999995,"24340","Grand Rapids-Kentwood, MI",null,"MI","Ionia",null,null,"Sandusky"]
["Iosco, MI",0.84819999999999995,"99923","Michigan",null,"MI","Iosco",null,null,"Scioto"]
["Iron, MI",0.84819999999999995,"99923","Michigan",null,"MI","Iron",null,null,"Trumbull"]
["Isabella, MI",0.84819999999999995,"99923","Michigan",null,"MI","Isabella",null,null,"Tuscarawas"]
["Jackson, MI",0.86299999999999999,"27100","Jackson, MI",null,"MI","Jackson",null,null,"Van Wert"]
["Kalamazoo, MI",0.94340000000000002,"28020","Kalamazoo-Portage, MI",null,"MI","Kalamazoo",null,null,"Vinton"]
["Kalkaska, MI",0.84819999999999995,"99923","Michigan",null,"MI","Kalkaska",null,null,"Wood"]
["Kent, MI",0.91979999999999995,"24340","Grand Rapids-Kentwood, MI",null,"MI","Kent",null,null,"Wyandot"]
["Keweenaw, MI",0.84819999999999995,"99923","Michigan",null,"MI","Keweenaw",null,"PA","Butler"]
["Lake, MI",0.84819999999999995,"99923","Michigan",null,"MI","Lake",null,null,"Fayette"]
["Lapeer, MI",0.93679999999999997,"47664","Warren-Troy-Farmington Hills, MI",null,"MI","Lapeer",null,null,"Franklin"]
["Leelanau, MI",0.84819999999999995,"99923","Michigan",null,"MI","Leelanau",null,null,"Greene"]
["Lenawee, MI",0.84819999999999995,"99923","Michigan",null,"MI","Lenawee",null,null,"Jefferson"]
["Livingston, MI",0.93679999999999997,"47664","Warren-Troy-Farmington Hills, MI",null,"MI","Livingston",null,null,"Lawrence"]
["Luce, MI",0.84819999999999995,"99923","Michigan",null,"MI","Luce",null,null,"Monroe"]
["Mackinac, MI",0.84819999999999995,"99923","Michigan",null,"MI","Mackinac",null,null,"Montgomery"]
["Macomb, MI",0.93679999999999997,"47664","Warren-Troy-Farmington Hills, MI",null,"MI","Macomb",null,null,"Perry"]
["Manistee, MI",0.84819999999999995,"99923","Michigan",null,"MI","Manistee",null,null,"Pike"]
["Marquette, MI",0.84819999999999995,"99923","Michigan",null,"MI","Marquette",null,null,"Washington"]
["Mason, MI",0.84819999999999995,"99923","Michigan",null,"MI","Mason",null,null,"Columbia"]
["Mecosta, MI",0.84819999999999995,"99923","Michigan",null,"MI","Mecosta",null,null,"Crawford"]
["Menominee, MI",0.84819999999999995,"99923","Michigan",null,"MI","Menominee",null,null,"Fulton"]
["Midland, MI",0.92030000000000001,"33220","Midland, MI",null,"MI","Midland",null,null,"Union"]
["Missaukee, MI",0.84819999999999995,"99923","Michigan",null,"MI","Missaukee",null,null,"Adams"]
["Monroe, MI",0.95599999999999996,"33780","Monroe, MI",null,"MI","Monroe",null,null,"Bradford"]
["Montcalm, MI",0.91979999999999995,"24340","Grand Rapids-Kentwood, MI",null,"MI","Montcalm",null,null,"Warren"]
["Montmorency, MI",0.84819999999999995,"99923","Michigan",null,"MI","Montmorency",null,null,"Wayne"]
["Muskegon, MI",0.87939999999999996,"34740","Muskegon, MI",null,"MI","Muskegon",null,null,"Clinton"]
["Newaygo, MI",0.84819999999999995,"99923","Michigan",null,"MI","Newaygo",null,null,"Cumberland"]
["Oakland, MI",0.93679999999999997,"47664","Warren-Troy-Farmington Hills, MI",null,"MI","Oakland",null,null,"Mercer"]
["Oceana, MI",0.84819999999999995,"99923","Michigan",null,"MI","Oceana",null,null,"Delaware"]
["Ogemaw, MI",0.84819999999999995,"99923","Michigan",null,"MI","Ogemaw",null,null,"Sullivan"]
["Ontonagon, MI",0.84819999999999995,"99923","Michigan",null,"MI","Ontonagon",null,null,"Elk"]
["Osceola, MI",0.84819999999999995,"99923","Michigan",null,"MI","Osceola",null,null,"Cameron"]
["Oscoda, MI",0.84819999999999995,"99923","Michigan",null,"MI","Oscoda",null,null,"Somerset"]
["Otsego, MI",0.84819999999999995,"99923","Michigan",null,"MI","Otsego",null,null,"York"]
["Ottawa, MI",0.91979999999999995,"24340","Grand Rapids-Kentwood, MI",null,"MI","Ottawa",null,null,"Carbon"]
["Presque Isle, MI",0.84819999999999995,"99923","Michigan",null,"MI","Presque Isle",null,null,"Lancaster"]
["Roscommon, MI",0.84819999999999995,"99923","Michigan",null,"MI","Roscommon",null,null,"Erie"]
["Saginaw, MI",0.87870000000000004,"40980","Saginaw, MI",null,"MI","Saginaw",null,null,"Tioga"]
["St. Clair, MI",0.93679999999999997,"47664","Warren-Troy-Farmington Hills, MI",null,"MI","St. Clair",null,null,"Wyoming"]
["St. Joseph, MI",0.84819999999999995,"99923","Michigan",null,"MI","St. Joseph",null,null,"Northampton"]
["Sanilac, MI",0.84819999999999995,"99923","Michigan",null,"MI","Sanilac",null,null,"Beaver"]
["Schoolcraft, MI",0.84819999999999995,"99923","Michigan",null,"MI","Schoolcraft",null,null,"Allegheny"]
["Shiawassee, MI",0.94699999999999995,"29620","Lansing-East Lansing, MI",null,"MI","Shiawassee",null,null,"Armstrong"]
["Tuscola, MI",0.84819999999999995,"99923","Michigan",null,"MI","Tuscola",null,null,"Bedford"]
["Van Buren, MI",0.94340000000000002,"99923","Michigan",null,"MI","Van Buren",null,null,"Berks"]
["Washtenaw, MI",0.99160000000000004,"11460","Ann Arbor, MI",null,"MI","Washtenaw",null,null,"Blair"]
["Wayne, MI",0.88200000000000001,"19804","Detroit-Dearborn-Livonia, MI",null,"MI","Wayne",null,null,"Bucks"]
["Wexford, MI",0.84819999999999995,"99923","Michigan",null,"MI","Wexford",null,null,"Cambria"]
["Aitkin, MN",0.90849999999999997,"99924","Minnesota",null,"MN","Aitkin",null,null,"Centre"]
["Anoka, MN",1.1091,"33460","Minneapolis-St. Paul-Bloomington, MN-WI",null,"MN","Anoka",null,null,"Chester"]
["Becker, MN",0.90849999999999997,"99924","Minnesota",null,"MN","Becker",null,null,"Clarion"]
["Beltrami, MN",0.90849999999999997,"99924","Minnesota",null,"MN","Beltrami",null,null,"Clearfield"]
["Benton, MN",0.97789999999999999,"41060","St. Cloud, MN",null,"MN","Benton",null,null,"Dauphin"]
["Big Stone, MN",0.90849999999999997,"99924","Minnesota",null,"MN","Big Stone",null,null,"Forest"]
["Blue Earth, MN",1.0286999999999999,"31860","Mankato, MN",null,"MN","Blue Earth",null,null,"Huntingdon"]
["Brown, MN",0.90849999999999997,"99924","Minnesota",null,"MN","Brown",null,null,"Indiana"]
["Carlton, MN",0.97150000000000003,"20260","Duluth, MN-WI",null,"MN","Carlton",null,null,"Juniata"]
["Carver, MN",1.1091,"33460","Minneapolis-St. Paul-Bloomington, MN-WI",null,"MN","Carver",null,null,"Lackawanna"]
["Cass, MN",0.90849999999999997,"99924","Minnesota",null,"MN","Cass",null,null,"Lebanon"]
["Chippewa, MN",0.90849999999999997,"99924","Minnesota",null,"MN","Chippewa",null,null,"Lehigh"]
["Chisago, MN",1.1091,"33460","Minneapolis-St. Paul-Bloomington, MN-WI",null,"MN","Chisago",null,null,"Luzerne"]
["Clay, MN",0.80269999999999997,"22020","Fargo, ND-MN",null,"MN","Clay",null,null,"Lycoming"]
["Clearwater, MN",0.90849999999999997,"99924","Minnesota",null,"MN","Clearwater",null,null,"Mc Kean"]
["Cook, MN",0.90849999999999997,"99924","Minnesota",null,"MN","Cook",null,null,"Mifflin"]
["Cottonwood, MN",0.90849999999999997,"99924","Minnesota",null,"MN","Cottonwood",null,null,"Montour"]
["Crow Wing, MN",0.90849999999999997,"99924","Minnesota",null,"MN","Crow Wing",null,null,"Northumberlnd"]
["Dakota, MN",1.1091,"33460","Minneapolis-St. Paul-Bloomington, MN-WI",null,"MN","Dakota",null,null,"Philadelphia"]
["Dodge, MN",1.0529999999999999,"40340","Rochester, MN",null,"MN","Dodge",null,null,"Potter"]
["Douglas, MN",0.90849999999999997,"99924","Minnesota",null,"MN","Douglas",null,null,"Schuylkill"]
["Faribault, MN",0.90849999999999997,"99924","Minnesota",null,"MN","Faribault",null,null,"Snyder"]
["Fillmore, MN",1.0529999999999999,"40340","Rochester, MN",null,"MN","Fillmore",null,null,"Susquehanna"]
["Freeborn, MN",0.90849999999999997,"99924","Minnesota",null,"MN","Freeborn",null,null,"Venango"]
["Goodhue, MN",0.90849999999999997,"99924","Minnesota",null,"MN","Goodhue",null,null,"Westmoreland"]
["Grant, MN",0.90849999999999997,"99924","Minnesota",null,"MN","Grant",null,"WA","Franklin"]
["Hennepin, MN",1.1091,"33460","Minneapolis-St. Paul-Bloomington, MN-WI",null,"MN","Hennepin",null,null,"Jefferson"]
["Houston, MN",0.90920000000000001,"29100","La Crosse-Onalaska, WI-MN",null,"MN","Houston",null,null,"Benton"]
["Hubbard, MN",0.90849999999999997,"99924","Minnesota",null,"MN","Hubbard",null,null,"Clark"]
["Isanti, MN",1.1091,"33460","Minneapolis-St. Paul-Bloomington, MN-WI",null,"MN","Isanti",null,null,"Columbia"]
["Itasca, MN",0.90849999999999997,"99924","Minnesota",null,"MN","Itasca",null,null,"Grant"]
["Jackson, MN",0.90849999999999997,"99924","Minnesota",null,"MN","Jackson",null,null,"Lincoln"]
["Kanabec, MN",0.90849999999999997,"99924","Minnesota",null,"MN","Kanabec",null,null,"Adams"]
["Kandiyohi, MN",0.90849999999999997,"99924","Minnesota",null,"MN","Kandiyohi",null,null,"Douglas"]
["Kittson, MN",0.90849999999999997,"99924","Minnesota",null,"MN","Kittson",null,null,"Garfield"]
["Koochiching, MN",0.90849999999999997,"99924","Minnesota",null,"MN","Koochiching",null,null,"San Juan"]
["Lac Qui Parle, MN",0.90849999999999997,"99924","Minnesota",null,"MN","Lac Qui Parle",null,null,"Pierce"]
["Lake, MN",0.97150000000000003,"20260","Duluth, MN-WI",null,"MN","Lake",null,null,"Lewis"]
["Lake Of  Woods, MN",0.90849999999999997,"99924","Minnesota",null,"MN","Lake Of  Woods",null,null,"Mason"]
["Le Sueur, MN",1.1091,"33460","Minneapolis-St. Paul-Bloomington, MN-WI",null,"MN","Le Sueur",null,null,"Stevens"]
["Lincoln, MN",0.90849999999999997,"99924","Minnesota",null,"MN","Lincoln",null,null,"Thurston"]
["Lyon, MN",0.90849999999999997,"99924","Minnesota",null,"MN","Lyon",null,null,"King"]
["Mc Leod, MN",0.90849999999999997,"99924","Minnesota",null,"MN","Mc Leod",null,null,"Asotin"]
["Mahnomen, MN",0.90849999999999997,"99924","Minnesota",null,"MN","Mahnomen",null,null,"Chelan"]
["Marshall, MN",0.90849999999999997,"99924","Minnesota",null,"MN","Marshall",null,null,"Clallam"]
["Martin, MN",0.90849999999999997,"99924","Minnesota",null,"MN","Martin",null,null,"Cowlitz"]
["Meeker, MN",0.90849999999999997,"99924","Minnesota",null,"MN","Meeker",null,null,"Ferry"]
["Mille Lacs, MN",1.1091,"33460","Minneapolis-St. Paul-Bloomington, MN-WI",null,"MN","Mille Lacs",null,null,"Grays Harbor"]
["Morrison, MN",0.90849999999999997,"99924","Minnesota",null,"MN","Morrison",null,null,"Island"]
["Mower, MN",0.90849999999999997,"99924","Minnesota",null,"MN","Mower",null,null,"Kitsap"]
["Murray, MN",0.90849999999999997,"99924","Minnesota",null,"MN","Murray",null,null,"Kittitas"]
["Nicollet, MN",1.0286999999999999,"31860","Mankato, MN",null,"MN","Nicollet",null,null,"Klickitat"]
["Nobles, MN",0.90849999999999997,"99924","Minnesota",null,"MN","Nobles",null,null,"Okanogan"]
["Norman, MN",0.90849999999999997,"99924","Minnesota",null,"MN","Norman",null,null,"Pacific"]
["Olmsted, MN",1.0529999999999999,"40340","Rochester, MN",null,"MN","Olmsted",null,null,"Pend Oreille"]
["Otter Tail, MN",0.90849999999999997,"99924","Minnesota",null,"MN","Otter Tail",null,null,"Skagit"]
["Pennington, MN",0.90849999999999997,"99924","Minnesota",null,"MN","Pennington",null,null,"Skamania"]
["Pine, MN",0.90849999999999997,"99924","Minnesota",null,"MN","Pine",null,null,"Snohomish"]
["Pipestone, MN",0.90849999999999997,"99924","Minnesota",null,"MN","Pipestone",null,null,"Spokane"]
["Polk, MN",0.84160000000000001,"24220","Grand Forks, ND-MN",null,"MN","Polk",null,null,"Wahkiakum"]
["Pope, MN",0.90849999999999997,"99924","Minnesota",null,"MN","Pope",null,null,"Walla Walla"]
["Ramsey, MN",1.1091,"33460","Minneapolis-St. Paul-Bloomington, MN-WI",null,"MN","Ramsey",null,null,"Whatcom"]
["Red Lake, MN",0.90849999999999997,"99924","Minnesota",null,"MN","Red Lake",null,null,"Whitman"]
["Redwood, MN",0.90849999999999997,"99924","Minnesota",null,"MN","Redwood",null,null,"Yakima"]
["Renville, MN",0.90849999999999997,"99924","Minnesota",null,"MN","Renville",null,"WI","Jackson"]
["Rice, MN",0.90849999999999997,"99924","Minnesota",null,"MN","Rice",null,null,"Jefferson"]
["Rock, MN",0.90849999999999997,"99924","Minnesota",null,"MN","Rock",null,null,"Monroe"]
["Roseau, MN",0.90849999999999997,"99924","Minnesota",null,"MN","Roseau",null,null,"Washington"]
["St. Louis, MN",0.97150000000000003,"20260","Duluth, MN-WI",null,"MN","St. Louis",null,null,"Juneau"]
["Scott, MN",1.1091,"33460","Minneapolis-St. Paul-Bloomington, MN-WI",null,"MN","Scott",null,null,"Clark"]
["Sherburne, MN",1.1091,"33460","Minneapolis-St. Paul-Bloomington, MN-WI",null,"MN","Sherburne",null,null,"Columbia"]
["Sibley, MN",1.0788,"99924","Minnesota",null,"MN","Sibley",null,null,"Crawford"]
["Stearns, MN",0.97789999999999999,"41060","St. Cloud, MN",null,"MN","Stearns",null,null,"Grant"]
["Steele, MN",0.90849999999999997,"99924","Minnesota",null,"MN","Steele",null,null,"Lafayette"]
["Stevens, MN",0.90849999999999997,"99924","Minnesota",null,"MN","Stevens",null,null,"Lincoln"]
["Swift, MN",0.90849999999999997,"99924","Minnesota",null,"MN","Swift",null,null,"Polk"]
["Todd, MN",0.90849999999999997,"99924","Minnesota",null,"MN","Todd",null,null,"Adams"]
["Traverse, MN",0.90849999999999997,"99924","Minnesota",null,"MN","Traverse",null,null,"Douglas"]
["Wabasha, MN",1.0529999999999999,"40340","Rochester, MN",null,"MN","Wabasha",null,null,"Taylor"]
["Wadena, MN",0.90849999999999997,"99924","Minnesota",null,"MN","Wadena",null,null,"Dodge"]
["Waseca, MN",0.90849999999999997,"99924","Minnesota",null,"MN","Waseca",null,null,"Pierce"]
["Washington, MN",1.1091,"33460","Minneapolis-St. Paul-Bloomington, MN-WI",null,"MN","Washington",null,null,"Oneida"]
["Watonwan, MN",0.90849999999999997,"99924","Minnesota",null,"MN","Watonwan",null,null,"Brown"]
["Wilkin, MN",0.90849999999999997,"99924","Minnesota",null,"MN","Wilkin",null,null,"Richland"]
["Winona, MN",0.90849999999999997,"99924","Minnesota",null,"MN","Winona",null,null,"Winnebago"]
["Wright, MN",1.1091,"33460","Minneapolis-St. Paul-Bloomington, MN-WI",null,"MN","Wright",null,null,"Iowa"]
["Yellow Medcine, MN",0.90849999999999997,"99924","Minnesota",null,"MN","Yellow Medcine",null,null,"Green"]
["Adams, MS",0.74639999999999995,"99925","Mississippi",null,"MS","Adams",null,null,"Vernon"]
["Alcorn, MS",0.74639999999999995,"99925","Mississippi",null,"MS","Alcorn",null,null,"Chippewa"]
["Amite, MS",0.74639999999999995,"99925","Mississippi",null,"MS","Amite",null,null,"Iron"]
["Attala, MS",0.74639999999999995,"99925","Mississippi",null,"MS","Attala",null,null,"Marquette"]
["Benton, MS",0.83150000000000002,"99925","Mississippi",null,"MS","Benton",null,null,"Rock"]
["Bolivar, MS",0.74639999999999995,"99925","Mississippi",null,"MS","Bolivar",null,null,"Buffalo"]
["Calhoun, MS",0.74639999999999995,"99925","Mississippi",null,"MS","Calhoun",null,null,"Dunn"]
["Carroll, MS",0.74639999999999995,"99925","Mississippi",null,"MS","Carroll",null,null,"Ashland"]
["Chickasaw, MS",0.74639999999999995,"99925","Mississippi",null,"MS","Chickasaw",null,null,"Portage"]
["Choctaw, MS",0.74639999999999995,"99925","Mississippi",null,"MS","Choctaw",null,null,"Wood"]
["Claiborne, MS",0.74639999999999995,"99925","Mississippi",null,"MS","Claiborne",null,null,"Forest"]
["Clarke, MS",0.74639999999999995,"99925","Mississippi",null,"MS","Clarke",null,null,"Florence"]
["Clay, MS",0.74639999999999995,"99925","Mississippi",null,"MS","Clay",null,null,"Walworth"]
["Coahoma, MS",0.74639999999999995,"99925","Mississippi",null,"MS","Coahoma",null,null,"Rusk"]
["Copiah, MS",0.82769999999999999,"27140","Jackson, MS",null,"MS","Copiah",null,null,"Barron"]
["Covington, MS",0.74380000000000002,"25620","Hattiesburg, MS",null,"MS","Covington",null,null,"Bayfield"]
["De Soto, MS",0.86699999999999999,"32820","Memphis, TN-MS-AR",null,"MS","De Soto",null,null,"Burnett"]
["Forrest, MS",0.74380000000000002,"25620","Hattiesburg, MS",null,"MS","Forrest",null,null,"Calumet"]
["Franklin, MS",0.74639999999999995,"99925","Mississippi",null,"MS","Franklin",null,null,"Dane"]
["George, MS",0.74639999999999995,"99925","Mississippi",null,"MS","George",null,null,"Door"]
["Greene, MS",0.74639999999999995,"99925","Mississippi",null,"MS","Greene",null,null,"Eau Claire"]
["Grenada, MS",0.74639999999999995,"99925","Mississippi",null,"MS","Grenada",null,null,"Fond Du Lac"]
["Hancock, MS",0.75409999999999999,"25060","Gulfport-Biloxi, MS",null,"MS","Hancock",null,null,"Green Lake"]
["Harrison, MS",0.75409999999999999,"25060","Gulfport-Biloxi, MS",null,"MS","Harrison",null,null,"Kenosha"]
["Hinds, MS",0.82769999999999999,"27140","Jackson, MS",null,"MS","Hinds",null,null,"Kewaunee"]
["Holmes, MS",0.82769999999999999,"27140","Jackson, MS",null,"MS","Holmes",null,null,"La Crosse"]
["Humphreys, MS",0.74639999999999995,"99925","Mississippi",null,"MS","Humphreys",null,null,"Langlade"]
["Issaquena, MS",0.74639999999999995,"99925","Mississippi",null,"MS","Issaquena",null,null,"Manitowoc"]
["Itawamba, MS",0.74639999999999995,"99925","Mississippi",null,"MS","Itawamba",null,null,"Marathon"]
["Jackson, MS",0.75409999999999999,"25060","Gulfport-Biloxi, MS",null,"MS","Jackson",null,null,"Marinette"]
["Jasper, MS",0.74639999999999995,"99925","Mississippi",null,"MS","Jasper",null,null,"Menomonee"]
["Jefferson, MS",0.74639999999999995,"99925","Mississippi",null,"MS","Jefferson",null,null,"Milwaukee"]
["Jefferson Davis, MS",0.74639999999999995,"99925","Mississippi",null,"MS","Jefferson Davis",null,null,"Oconto"]
["Jones, MS",0.74639999999999995,"99925","Mississippi",null,"MS","Jones",null,null,"Outagamie"]
["Kemper, MS",0.74639999999999995,"99925","Mississippi",null,"MS","Kemper",null,null,"Ozaukee"]
["Lafayette, MS",0.74639999999999995,"99925","Mississippi",null,"MS","Lafayette",null,null,"Pepin"]
["Lamar, MS",0.74380000000000002,"25620","Hattiesburg, MS",null,"MS","Lamar",null,null,"Price"]
["Lauderdale, MS",0.74639999999999995,"99925","Mississippi",null,"MS","Lauderdale",null,null,"Racine"]
["Lawrence, MS",0.74639999999999995,"99925","Mississippi",null,"MS","Lawrence",null,null,"St. Croix"]
["Leake, MS",0.74639999999999995,"99925","Mississippi",null,"MS","Leake",null,null,"Sauk"]
["Lee, MS",0.74639999999999995,"99925","Mississippi",null,"MS","Lee",null,null,"Sawyer"]
["Leflore, MS",0.74639999999999995,"99925","Mississippi",null,"MS","Leflore",null,null,"Shawano"]
["Lincoln, MS",0.74639999999999995,"99925","Mississippi",null,"MS","Lincoln",null,null,"Sheboygan"]
["Lowndes, MS",0.74639999999999995,"99925","Mississippi",null,"MS","Lowndes",null,null,"Trempealeau"]
["Madison, MS",0.82769999999999999,"27140","Jackson, MS",null,"MS","Madison",null,null,"Vilas"]
["Marion, MS",0.74639999999999995,"99925","Mississippi",null,"MS","Marion",null,null,"Washburn"]
["Marshall, MS",0.86699999999999999,"32820","Memphis, TN-MS-AR",null,"MS","Marshall",null,null,"Waukesha"]
["Monroe, MS",0.74639999999999995,"99925","Mississippi",null,"MS","Monroe",null,null,"Waupaca"]
["Montgomery, MS",0.74639999999999995,"99925","Mississippi",null,"MS","Montgomery",null,null,"Waushara"]
["Neshoba, MS",0.74639999999999995,"99925","Mississippi",null,"MS","Neshoba",null,"VT","Franklin"]
["Newton, MS",0.74639999999999995,"99925","Mississippi",null,"MS","Newton",null,null,"Washington"]
["Noxubee, MS",0.74639999999999995,"99925","Mississippi",null,"MS","Noxubee",null,null,"Orange"]
["Oktibbeha, MS",0.74639999999999995,"99925","Mississippi",null,"MS","Oktibbeha",null,null,"Windham"]
["Panola, MS",0.74639999999999995,"99925","Mississippi",null,"MS","Panola",null,null,"Orleans"]
["Pearl River, MS",0.74639999999999995,"99925","Mississippi",null,"MS","Pearl River",null,null,"Essex"]
["Perry, MS",0.74380000000000002,"25620","Hattiesburg, MS",null,"MS","Perry",null,null,"Addison"]
["Pike, MS",0.74639999999999995,"99925","Mississippi",null,"MS","Pike",null,null,"Bennington"]
["Pontotoc, MS",0.74639999999999995,"99925","Mississippi",null,"MS","Pontotoc",null,null,"Caledonia"]
["Prentiss, MS",0.74639999999999995,"99925","Mississippi",null,"MS","Prentiss",null,null,"Chittenden"]
["Quitman, MS",0.74639999999999995,"99925","Mississippi",null,"MS","Quitman",null,null,"Grand Isle"]
["Rankin, MS",0.82769999999999999,"27140","Jackson, MS",null,"MS","Rankin",null,null,"Lamoille"]
["Scott, MS",0.74639999999999995,"99925","Mississippi",null,"MS","Scott",null,null,"Rutland"]
["Sharkey, MS",0.74639999999999995,"99925","Mississippi",null,"MS","Sharkey",null,null,"Windsor"]
["Simpson, MS",0.82769999999999999,"27140","Jackson, MS",null,"MS","Simpson",null,"PR","Rio Grande"]
["Smith, MS",0.74639999999999995,"99925","Mississippi",null,"MS","Smith",null,null,"San Juan"]
["Stone, MS",0.75409999999999999,"25060","Gulfport-Biloxi, MS",null,"MS","Stone",null,null,"Adjuntas"]
["Sunflower, MS",0.74639999999999995,"99925","Mississippi",null,"MS","Sunflower",null,null,"Aguada"]
["Tallahatchie, MS",0.74639999999999995,"99925","Mississippi",null,"MS","Tallahatchie",null,null,"Aguadilla"]
["Tate, MS",0.86699999999999999,"32820","Memphis, TN-MS-AR",null,"MS","Tate",null,null,"Aguas Buenas"]
["Tippah, MS",0.74639999999999995,"99925","Mississippi",null,"MS","Tippah",null,null,"Aibonito"]
["Tishomingo, MS",0.74639999999999995,"99925","Mississippi",null,"MS","Tishomingo",null,null,"Anasco"]
["Tunica, MS",0.86699999999999999,"32820","Memphis, TN-MS-AR",null,"MS","Tunica",null,null,"Arecibo"]
["Union, MS",0.74639999999999995,"99925","Mississippi",null,"MS","Union",null,null,"Arroyo"]
["Walthall, MS",0.74639999999999995,"99925","Mississippi",null,"MS","Walthall",null,null,"Barceloneta"]
["Warren, MS",0.74639999999999995,"99925","Mississippi",null,"MS","Warren",null,null,"Barranquitas"]
["Washington, MS",0.74639999999999995,"99925","Mississippi",null,"MS","Washington",null,null,"Bayamon"]
["Wayne, MS",0.74639999999999995,"99925","Mississippi",null,"MS","Wayne",null,null,"Cabo Rojo"]
["Webster, MS",0.74639999999999995,"99925","Mississippi",null,"MS","Webster",null,null,"Caguas"]
["Wilkinson, MS",0.74639999999999995,"99925","Mississippi",null,"MS","Wilkinson",null,null,"Camuy"]
["Winston, MS",0.74639999999999995,"99925","Mississippi",null,"MS","Winston",null,null,"Canovanas"]
["Yalobusha, MS",0.74639999999999995,"99925","Mississippi",null,"MS","Yalobusha",null,null,"Carolina"]
["Yazoo, MS",0.82769999999999999,"27140","Jackson, MS",null,"MS","Yazoo",null,null,"Catano"]
["Adair, MO",0.77780000000000005,"99926","Missouri",null,"MO","Adair",null,null,"Cayey"]
["Andrew, MO",0.94720000000000004,"41140","St. Joseph, MO-KS",null,"MO","Andrew",null,null,"Ceiba"]
["Atchison, MO",0.77780000000000005,"99926","Missouri",null,"MO","Atchison",null,null,"Ciales"]
["Audrain, MO",0.77780000000000005,"99926","Missouri",null,"MO","Audrain",null,null,"Cidra"]
["Barry, MO",0.77780000000000005,"99926","Missouri",null,"MO","Barry",null,null,"Coamo"]
["Barton, MO",0.77780000000000005,"99926","Missouri",null,"MO","Barton",null,null,"Comerio"]
["Bates, MO",0.91249999999999998,"28140","Kansas City, MO-KS",null,"MO","Bates",null,null,"Corozal"]
["Benton, MO",0.77780000000000005,"99926","Missouri",null,"MO","Benton",null,null,"Culebra"]
["Bollinger, MO",0.80189999999999995,"16020","Cape Girardeau, MO-IL",null,"MO","Bollinger",null,null,"Dorado"]
["Boone, MO",0.83589999999999998,"17860","Columbia, MO",null,"MO","Boone",null,null,"Fajardo"]
["Buchanan, MO",0.94720000000000004,"41140","St. Joseph, MO-KS",null,"MO","Buchanan",null,null,"Florida"]
["Butler, MO",0.77780000000000005,"99926","Missouri",null,"MO","Butler",null,null,"Guanica"]
["Caldwell, MO",0.91249999999999998,"28140","Kansas City, MO-KS",null,"MO","Caldwell",null,null,"Guayama"]
["Callaway, MO",0.82699999999999996,"27620","Jefferson City, MO",null,"MO","Callaway",null,null,"Guayanilla"]
["Camden, MO",0.77780000000000005,"99926","Missouri",null,"MO","Camden",null,null,"Guaynabo"]
["Cape Girardeau, MO",0.80189999999999995,"16020","Cape Girardeau, MO-IL",null,"MO","Cape Girardeau",null,null,"Gurabo"]
["Carroll, MO",0.77780000000000005,"99926","Missouri",null,"MO","Carroll",null,null,"Hatillo"]
["Carter, MO",0.77780000000000005,"99926","Missouri",null,"MO","Carter",null,null,"Hormigueros"]
["Cass, MO",0.91249999999999998,"28140","Kansas City, MO-KS",null,"MO","Cass",null,null,"Humacao"]
["Cedar, MO",0.77780000000000005,"99926","Missouri",null,"MO","Cedar",null,null,"Isabela"]
["Chariton, MO",0.77780000000000005,"99926","Missouri",null,"MO","Chariton",null,null,"Jayuya"]
["Christian, MO",0.78059999999999996,"44180","Springfield, MO",null,"MO","Christian",null,null,"Juana Diaz"]
["Clark, MO",0.77780000000000005,"99926","Missouri",null,"MO","Clark",null,null,"Juncos"]
["Clay, MO",0.91249999999999998,"28140","Kansas City, MO-KS",null,"MO","Clay",null,null,"Lajas"]
["Clinton, MO",0.91249999999999998,"28140","Kansas City, MO-KS",null,"MO","Clinton",null,null,"Lares"]
["Cole, MO",0.82699999999999996,"27620","Jefferson City, MO",null,"MO","Cole",null,null,"Las Marias"]
["Cooper, MO",0.83589999999999998,"17860","Columbia, MO",null,"MO","Cooper",null,null,"Las Piedras"]
["Crawford, MO",0.77780000000000005,"99926","Missouri",null,"MO","Crawford",null,null,"Loiza"]
["Dade, MO",0.77780000000000005,"99926","Missouri",null,"MO","Dade",null,null,"Luquillo"]
["Dallas, MO",0.78059999999999996,"44180","Springfield, MO",null,"MO","Dallas",null,null,"Manati"]
["Daviess, MO",0.77780000000000005,"99926","Missouri",null,"MO","Daviess",null,null,"Maricao"]
["De Kalb, MO",0.94720000000000004,"41140","St. Joseph, MO-KS",null,"MO","De Kalb",null,null,"Maunabo"]
["Dent, MO",0.77780000000000005,"99926","Missouri",null,"MO","Dent",null,null,"Mayaguez"]
["Douglas, MO",0.77780000000000005,"99926","Missouri",null,"MO","Douglas",null,null,"Moca"]
["Dunklin, MO",0.77780000000000005,"99926","Missouri",null,"MO","Dunklin",null,null,"Morovis"]
["Franklin, MO",0.93169999999999997,"41180","St. Louis, MO-IL",null,"MO","Franklin",null,null,"Maguabo"]
["Gasconade, MO",0.77780000000000005,"99926","Missouri",null,"MO","Gasconade",null,null,"Naranjito"]
["Gentry, MO",0.77780000000000005,"99926","Missouri",null,"MO","Gentry",null,null,"Orocovis"]
["Greene, MO",0.78059999999999996,"44180","Springfield, MO",null,"MO","Greene",null,null,"Patillas"]
["Grundy, MO",0.77780000000000005,"99926","Missouri",null,"MO","Grundy",null,null,"Penuelas"]
["Harrison, MO",0.77780000000000005,"99926","Missouri",null,"MO","Harrison",null,null,"Ponce"]
["Henry, MO",0.77780000000000005,"99926","Missouri",null,"MO","Henry",null,null,"Quebradillas"]
["Hickory, MO",0.77780000000000005,"99926","Missouri",null,"MO","Hickory",null,null,"Rincon"]
["Holt, MO",0.77780000000000005,"99926","Missouri",null,"MO","Holt",null,null,"Sabana Grande"]
["Howard, MO",0.83589999999999998,"17860","Columbia, MO",null,"MO","Howard",null,null,"Salinas"]
["Howell, MO",0.77780000000000005,"99926","Missouri",null,"MO","Howell",null,null,"San German"]
["Iron, MO",0.77780000000000005,"99926","Missouri",null,"MO","Iron",null,null,"San Lorenzo"]
["Jackson, MO",0.91249999999999998,"28140","Kansas City, MO-KS",null,"MO","Jackson",null,null,"San Sebastian"]
["Jasper, MO",0.76870000000000005,"27900","Joplin, MO",null,"MO","Jasper",null,null,"Santa Isabel"]
["Jefferson, MO",0.93169999999999997,"41180","St. Louis, MO-IL",null,"MO","Jefferson",null,null,"Toa Alta"]
["Johnson, MO",0.77780000000000005,"99926","Missouri",null,"MO","Johnson",null,null,"Toa Baja"]
["Knox, MO",0.77780000000000005,"99926","Missouri",null,"MO","Knox",null,null,"Trujillo Alto"]
["Laclede, MO",0.77780000000000005,"99926","Missouri",null,"MO","Laclede",null,null,"Utuado"]
["Lafayette, MO",0.91249999999999998,"28140","Kansas City, MO-KS",null,"MO","Lafayette",null,null,"Vega Alta"]
["Lawrence, MO",0.77780000000000005,"99926","Missouri",null,"MO","Lawrence",null,null,"Vega Baja"]
["Lewis, MO",0.77780000000000005,"99926","Missouri",null,"MO","Lewis",null,null,"Vieques"]
["Lincoln, MO",0.93169999999999997,"41180","St. Louis, MO-IL",null,"MO","Lincoln",null,null,"Villalba"]
["Linn, MO",0.77780000000000005,"99926","Missouri",null,"MO","Linn",null,null,"Yabucoa"]
["Livingston, MO",0.77780000000000005,"99926","Missouri",null,"MO","Livingston",null,null,"Yauco"]
["Mc Donald, MO",0.79069999999999996,"99926","Missouri",null,"MO","Mc Donald",null,"MN","Clay"]
["Macon, MO",0.77780000000000005,"99926","Missouri",null,"MO","Macon",null,null,"Houston"]
["Madison, MO",0.77780000000000005,"99926","Missouri",null,"MO","Madison",null,null,"Jackson"]
["Maries, MO",0.77780000000000005,"99926","Missouri",null,"MO","Maries",null,null,"Marshall"]
["Marion, MO",0.77780000000000005,"99926","Missouri",null,"MO","Marion",null,null,"Washington"]
["Mercer, MO",0.77780000000000005,"99926","Missouri",null,"MO","Mercer",null,null,"Benton"]
["Miller, MO",0.77780000000000005,"99926","Missouri",null,"MO","Miller",null,null,"Grant"]
["Mississippi, MO",0.77780000000000005,"99926","Missouri",null,"MO","Mississippi",null,null,"Lincoln"]
["Moniteau, MO",0.82699999999999996,"27620","Jefferson City, MO",null,"MO","Moniteau",null,null,"Polk"]
["Monroe, MO",0.77780000000000005,"99926","Missouri",null,"MO","Monroe",null,null,"Pope"]
["Montgomery, MO",0.77780000000000005,"99926","Missouri",null,"MO","Montgomery",null,null,"Scott"]
["Morgan, MO",0.77780000000000005,"99926","Missouri",null,"MO","Morgan",null,null,"Lake"]
["New Madrid, MO",0.77780000000000005,"99926","Missouri",null,"MO","New Madrid",null,null,"Douglas"]
["Newton, MO",0.76870000000000005,"27900","Joplin, MO",null,"MO","Newton",null,null,"Martin"]
["Nodaway, MO",0.77780000000000005,"99926","Missouri",null,"MO","Nodaway",null,null,"Cook"]
["Oregon, MO",0.77780000000000005,"99926","Missouri",null,"MO","Oregon",null,null,"Dodge"]
["Osage, MO",0.82699999999999996,"27620","Jefferson City, MO",null,"MO","Osage",null,null,"Murray"]
["Ozark, MO",0.77780000000000005,"99926","Missouri",null,"MO","Ozark",null,null,"Clearwater"]
["Pemiscot, MO",0.77780000000000005,"99926","Missouri",null,"MO","Pemiscot",null,null,"Brown"]
["Perry, MO",0.77780000000000005,"99926","Missouri",null,"MO","Perry",null,null,"Cass"]
["Pettis, MO",0.77780000000000005,"99926","Missouri",null,"MO","Pettis",null,null,"Lyon"]
["Phelps, MO",0.77780000000000005,"99926","Missouri",null,"MO","Phelps",null,null,"Wright"]
["Pike, MO",0.77780000000000005,"99926","Missouri",null,"MO","Pike",null,null,"Rice"]
["Platte, MO",0.91249999999999998,"28140","Kansas City, MO-KS",null,"MO","Platte",null,null,"Stevens"]
["Polk, MO",0.78059999999999996,"44180","Springfield, MO",null,"MO","Polk",null,null,"Todd"]
["Pulaski, MO",0.77780000000000005,"99926","Missouri",null,"MO","Pulaski",null,null,"Chippewa"]
["Putnam, MO",0.77780000000000005,"99926","Missouri",null,"MO","Putnam",null,null,"Aitkin"]
["Ralls, MO",0.77780000000000005,"99926","Missouri",null,"MO","Ralls",null,null,"Anoka"]
["Randolph, MO",0.77780000000000005,"99926","Missouri",null,"MO","Randolph",null,null,"Becker"]
["Ray, MO",0.91249999999999998,"28140","Kansas City, MO-KS",null,"MO","Ray",null,null,"Beltrami"]
["Reynolds, MO",0.77780000000000005,"99926","Missouri",null,"MO","Reynolds",null,null,"Big Stone"]
["Ripley, MO",0.77780000000000005,"99926","Missouri",null,"MO","Ripley",null,null,"Blue Earth"]
["St. Charles, MO",0.93169999999999997,"41180","St. Louis, MO-IL",null,"MO","St. Charles",null,null,"Carlton"]
["St. Clair, MO",0.77780000000000005,"99926","Missouri",null,"MO","St. Clair",null,null,"Carver"]
["St. Francois, MO",0.77780000000000005,"99926","Missouri",null,"MO","St. Francois",null,null,"Chisago"]
["St. Louis, MO",0.93169999999999997,"41180","St. Louis, MO-IL",null,"MO","St. Louis",null,null,"Cottonwood"]
["St. Louis City, MO",0.93169999999999997,"41180","St. Louis, MO-IL",null,"MO","St. Louis City",null,null,"Crow Wing"]
["Ste. Genevieve, MO",0.77780000000000005,"99926","Missouri",null,"MO","Ste. Genevieve",null,null,"Dakota"]
["Saline, MO",0.77780000000000005,"99926","Missouri",null,"MO","Saline",null,null,"Faribault"]
["Schuyler, MO",0.77780000000000005,"99926","Missouri",null,"MO","Schuyler",null,null,"Fillmore"]
["Scotland, MO",0.77780000000000005,"99926","Missouri",null,"MO","Scotland",null,null,"Freeborn"]
["Scott, MO",0.77780000000000005,"99926","Missouri",null,"MO","Scott",null,null,"Goodhue"]
["Shannon, MO",0.77780000000000005,"99926","Missouri",null,"MO","Shannon",null,null,"Hennepin"]
["Shelby, MO",0.77780000000000005,"99926","Missouri",null,"MO","Shelby",null,null,"Hubbard"]
["Stoddard, MO",0.77780000000000005,"99926","Missouri",null,"MO","Stoddard",null,null,"Isanti"]
["Stone, MO",0.77780000000000005,"99926","Missouri",null,"MO","Stone",null,null,"Itasca"]
["Sullivan, MO",0.77780000000000005,"99926","Missouri",null,"MO","Sullivan",null,null,"Kanabec"]
["Taney, MO",0.77780000000000005,"99926","Missouri",null,"MO","Taney",null,null,"Kandiyohi"]
["Texas, MO",0.77780000000000005,"99926","Missouri",null,"MO","Texas",null,null,"Kittson"]
["Vernon, MO",0.77780000000000005,"99926","Missouri",null,"MO","Vernon",null,null,"Koochiching"]
["Warren, MO",0.93169999999999997,"41180","St. Louis, MO-IL",null,"MO","Warren",null,null,"Lac Qui Parle"]
["Washington, MO",0.77780000000000005,"99926","Missouri",null,"MO","Washington",null,null,"Lake Of  Woods"]
["Wayne, MO",0.77780000000000005,"99926","Missouri",null,"MO","Wayne",null,null,"Le Sueur"]
["Webster, MO",0.78059999999999996,"44180","Springfield, MO",null,"MO","Webster",null,null,"Mc Leod"]
["Worth, MO",0.77780000000000005,"99926","Missouri",null,"MO","Worth",null,null,"Mahnomen"]
["Wright, MO",0.77780000000000005,"99926","Missouri",null,"MO","Wright",null,null,"Meeker"]
["Beaverhead, MT",0.8569,"99927","Montana",null,"MT","Beaverhead",null,null,"Mille Lacs"]
["Big Horn, MT",0.8569,"99927","Montana",null,"MT","Big Horn",null,null,"Morrison"]
["Blaine, MT",0.8569,"99927","Montana",null,"MT","Blaine",null,null,"Mower"]
["Broadwater, MT",0.8569,"99927","Montana",null,"MT","Broadwater",null,null,"Nicollet"]
["Carbon, MT",0.92869999999999997,"13740","Billings, MT",null,"MT","Carbon",null,null,"Nobles"]
["Carter, MT",0.8569,"99927","Montana",null,"MT","Carter",null,null,"Norman"]
["Cascade, MT",0.81730000000000003,"24500","Great Falls, MT",null,"MT","Cascade",null,null,"Olmsted"]
["Chouteau, MT",0.8569,"99927","Montana",null,"MT","Chouteau",null,null,"Otter Tail"]
["Custer, MT",0.8569,"99927","Montana",null,"MT","Custer",null,null,"Pennington"]
["Daniels, MT",0.8569,"99927","Montana",null,"MT","Daniels",null,null,"Pine"]
["Dawson, MT",0.8569,"99927","Montana",null,"MT","Dawson",null,null,"Pipestone"]
["Deer Lodge, MT",0.8569,"99927","Montana",null,"MT","Deer Lodge",null,null,"Ramsey"]
["Fallon, MT",0.8569,"99927","Montana",null,"MT","Fallon",null,null,"Red Lake"]
["Fergus, MT",0.8569,"99927","Montana",null,"MT","Fergus",null,null,"Redwood"]
["Flathead, MT",0.8569,"99927","Montana",null,"MT","Flathead",null,null,"Renville"]
["Gallatin, MT",0.8569,"99927","Montana",null,"MT","Gallatin",null,null,"Rock"]
["Garfield, MT",0.8569,"99927","Montana",null,"MT","Garfield",null,null,"Roseau"]
["Glacier, MT",0.8569,"99927","Montana",null,"MT","Glacier",null,null,"St. Louis"]
["Golden Valley, MT",0.87629999999999997,"99927","Montana",null,"MT","Golden Valley",null,null,"Sherburne"]
["Granite, MT",0.8569,"99927","Montana",null,"MT","Granite",null,null,"Sibley"]
["Hill, MT",0.8569,"99927","Montana",null,"MT","Hill",null,null,"Stearns"]
["Jefferson, MT",0.8569,"99927","Montana",null,"MT","Jefferson",null,null,"Steele"]
["Judith Basin, MT",0.8569,"99927","Montana",null,"MT","Judith Basin",null,null,"Swift"]
["Lake, MT",0.8569,"99927","Montana",null,"MT","Lake",null,null,"Traverse"]
["Lewis And Clark, MT",0.8569,"99927","Montana",null,"MT","Lewis And Clark",null,null,"Wabasha"]
["Liberty, MT",0.8569,"99927","Montana",null,"MT","Liberty",null,null,"Wadena"]
["Lincoln, MT",0.8569,"99927","Montana",null,"MT","Lincoln",null,null,"Waseca"]
["Mccone, MT",0.8569,"99927","Montana",null,"MT","Mccone",null,null,"Watonwan"]
["Madison, MT",0.8569,"99927","Montana",null,"MT","Madison",null,null,"Wilkin"]
["Meagher, MT",0.8569,"99927","Montana",null,"MT","Meagher",null,null,"Winona"]
["Mineral, MT",0.8569,"99927","Montana",null,"MT","Mineral",null,null,"Yellow Medcine"]
["Missoula, MT",0.93200000000000005,"33540","Missoula, MT",null,"MT","Missoula",null,"FL","Calhoun"]
["Musselshell, MT",0.8569,"99927","Montana",null,"MT","Musselshell",null,null,"Clay"]
["Park, MT",0.8569,"99927","Montana",null,"MT","Park",null,null,"Escambia"]
["Petroleum, MT",0.8569,"99927","Montana",null,"MT","Petroleum",null,null,"Franklin"]
["Phillips, MT",0.8569,"99927","Montana",null,"MT","Phillips",null,null,"Jackson"]
["Pondera, MT",0.8569,"99927","Montana",null,"MT","Pondera",null,null,"Jefferson"]
["Powder River, MT",0.8569,"99927","Montana",null,"MT","Powder River",null,null,"Lee"]
["Powell, MT",0.8569,"99927","Montana",null,"MT","Powell",null,null,"Madison"]
["Prairie, MT",0.8569,"99927","Montana",null,"MT","Prairie",null,null,"Marion"]
["Ravalli, MT",0.8569,"99927","Montana",null,"MT","Ravalli",null,null,"Monroe"]
["Richland, MT",0.8569,"99927","Montana",null,"MT","Richland",null,null,"Sumter"]
["Roosevelt, MT",0.8569,"99927","Montana",null,"MT","Roosevelt",null,null,"Washington"]
["Rosebud, MT",0.8569,"99927","Montana",null,"MT","Rosebud",null,null,"Columbia"]
["Sanders, MT",0.8569,"99927","Montana",null,"MT","Sanders",null,null,"Lafayette"]
["Sheridan, MT",0.8569,"99927","Montana",null,"MT","Sheridan",null,null,"Polk"]
["Silver Bow, MT",0.8569,"99927","Montana",null,"MT","Silver Bow",null,null,"Union"]
["Stillwater, MT",0.92869999999999997,"13740","Billings, MT",null,"MT","Stillwater",null,null,"Lake"]
["Sweet Grass, MT",0.8569,"99927","Montana",null,"MT","Sweet Grass",null,null,"Orange"]
["Teton, MT",0.8569,"99927","Montana",null,"MT","Teton",null,null,"Alachua"]
["Toole, MT",0.8569,"99927","Montana",null,"MT","Toole",null,null,"Baker"]
["Treasure, MT",0.8569,"99927","Montana",null,"MT","Treasure",null,null,"Bay"]
["Valley, MT",0.8569,"99927","Montana",null,"MT","Valley",null,null,"Bradford"]
["Wheatland, MT",0.8569,"99927","Montana",null,"MT","Wheatland",null,null,"Brevard"]
["Wibaux, MT",0.8569,"99927","Montana",null,"MT","Wibaux",null,null,"Broward"]
["Yellowstone, MT",0.92869999999999997,"13740","Billings, MT",null,"MT","Yellowstone",null,null,"Charlotte"]
["Adams, NE",0.88759999999999994,"99928","Nebraska",null,"NE","Adams",null,null,"Citrus"]
["Antelope, NE",0.88759999999999994,"99928","Nebraska",null,"NE","Antelope",null,null,"Collier"]
["Arthur, NE",0.88759999999999994,"99928","Nebraska",null,"NE","Arthur",null,null,"Miami-Dade"]
["Banner, NE",0.88759999999999994,"99928","Nebraska",null,"NE","Banner",null,null,"De Soto"]
["Blaine, NE",0.88759999999999994,"99928","Nebraska",null,"NE","Blaine",null,null,"Dixie"]
["Boone, NE",0.88759999999999994,"99928","Nebraska",null,"NE","Boone",null,null,"Duval"]
["Box Butte, NE",0.88759999999999994,"99928","Nebraska",null,"NE","Box Butte",null,null,"Flagler"]
["Boyd, NE",0.88759999999999994,"99928","Nebraska",null,"NE","Boyd",null,null,"Gadsden"]
["Brown, NE",0.88759999999999994,"99928","Nebraska",null,"NE","Brown",null,null,"Gilchrist"]
["Buffalo, NE",0.88759999999999994,"99928","Nebraska",null,"NE","Buffalo",null,null,"Glades"]
["Burt, NE",0.88759999999999994,"99928","Nebraska",null,"NE","Burt",null,null,"Gulf"]
["Butler, NE",0.88759999999999994,"99928","Nebraska",null,"NE","Butler",null,null,"Hamilton"]
["Cass, NE",0.95050000000000001,"36540","Omaha-Council Bluffs, NE-IA",null,"NE","Cass",null,null,"Hardee"]
["Cedar, NE",0.88759999999999994,"99928","Nebraska",null,"NE","Cedar",null,null,"Hendry"]
["Chase, NE",0.88759999999999994,"99928","Nebraska",null,"NE","Chase",null,null,"Hernando"]
["Cherry, NE",0.88759999999999994,"99928","Nebraska",null,"NE","Cherry",null,null,"Highlands"]
["Cheyenne, NE",0.88759999999999994,"99928","Nebraska",null,"NE","Cheyenne",null,null,"Hillsborough"]
["Clay, NE",0.88759999999999994,"99928","Nebraska",null,"NE","Clay",null,null,"Holmes"]
["Colfax, NE",0.88759999999999994,"99928","Nebraska",null,"NE","Colfax",null,null,"Indian River"]
["Cuming, NE",0.88759999999999994,"99928","Nebraska",null,"NE","Cuming",null,null,"Leon"]
["Custer, NE",0.88759999999999994,"99928","Nebraska",null,"NE","Custer",null,null,"Levy"]
["Dakota, NE",0.84399999999999997,"43580","Sioux City, IA-NE-SD",null,"NE","Dakota",null,null,"Liberty"]
["Dawes, NE",0.88759999999999994,"99928","Nebraska",null,"NE","Dawes",null,null,"Manatee"]
["Dawson, NE",0.88759999999999994,"99928","Nebraska",null,"NE","Dawson",null,null,"Martin"]
["Deuel, NE",0.88759999999999994,"99928","Nebraska",null,"NE","Deuel",null,null,"Nassau"]
["Dixon, NE",0.84399999999999997,"43580","Sioux City, IA-NE-SD",null,"NE","Dixon",null,null,"Okaloosa"]
["Dodge, NE",0.88759999999999994,"99928","Nebraska",null,"NE","Dodge",null,null,"Okeechobee"]
["Douglas, NE",0.95050000000000001,"36540","Omaha-Council Bluffs, NE-IA",null,"NE","Douglas",null,null,"Osceola"]
["Dundy, NE",0.88759999999999994,"99928","Nebraska",null,"NE","Dundy",null,null,"Palm Beach"]
["Fillmore, NE",0.88759999999999994,"99928","Nebraska",null,"NE","Fillmore",null,null,"Pasco"]
["Franklin, NE",0.88759999999999994,"99928","Nebraska",null,"NE","Franklin",null,null,"Pinellas"]
["Frontier, NE",0.88759999999999994,"99928","Nebraska",null,"NE","Frontier",null,null,"Putnam"]
["Furnas, NE",0.88759999999999994,"99928","Nebraska",null,"NE","Furnas",null,null,"St. Johns"]
["Gage, NE",0.88759999999999994,"99928","Nebraska",null,"NE","Gage",null,null,"St. Lucie"]
["Garden, NE",0.88759999999999994,"99928","Nebraska",null,"NE","Garden",null,null,"Santa Rosa"]
["Garfield, NE",0.88759999999999994,"99928","Nebraska",null,"NE","Garfield",null,null,"Sarasota"]
["Gosper, NE",0.88759999999999994,"99928","Nebraska",null,"NE","Gosper",null,null,"Seminole"]
["Grant, NE",0.88759999999999994,"99928","Nebraska",null,"NE","Grant",null,null,"Suwannee"]
["Greeley, NE",0.88759999999999994,"99928","Nebraska",null,"NE","Greeley",null,null,"Taylor"]
["Hall, NE",0.95850000000000002,"24260","Grand Island, NE",null,"NE","Hall",null,null,"Volusia"]
["Hamilton, NE",0.91020000000000001,"99928","Nebraska",null,"NE","Hamilton",null,null,"Wakulla"]
["Harlan, NE",0.88759999999999994,"99928","Nebraska",null,"NE","Harlan",null,null,"Walton"]
["Hayes, NE",0.88759999999999994,"99928","Nebraska",null,"NE","Hayes",null,"NC","Cherokee"]
["Hitchcock, NE",0.88759999999999994,"99928","Nebraska",null,"NE","Hitchcock",null,null,"Clay"]
["Holt, NE",0.88759999999999994,"99928","Nebraska",null,"NE","Holt",null,null,"Franklin"]
["Hooker, NE",0.88759999999999994,"99928","Nebraska",null,"NE","Hooker",null,null,"Greene"]
["Howard, NE",0.95850000000000002,"24260","Grand Island, NE",null,"NE","Howard",null,null,"Jackson"]
["Jefferson, NE",0.88759999999999994,"99928","Nebraska",null,"NE","Jefferson",null,null,"Lee"]
["Johnson, NE",0.88759999999999994,"99928","Nebraska",null,"NE","Johnson",null,null,"Macon"]
["Kearney, NE",0.88759999999999994,"99928","Nebraska",null,"NE","Kearney",null,null,"Madison"]
["Keith, NE",0.88759999999999994,"99928","Nebraska",null,"NE","Keith",null,null,"Montgomery"]
["Keya Paha, NE",0.88759999999999994,"99928","Nebraska",null,"NE","Keya Paha",null,null,"Randolph"]
["Kimball, NE",0.88759999999999994,"99928","Nebraska",null,"NE","Kimball",null,null,"Washington"]
["Knox, NE",0.88759999999999994,"99928","Nebraska",null,"NE","Knox",null,null,"Graham"]
["Lancaster, NE",0.97440000000000004,"30700","Lincoln, NE",null,"NE","Lancaster",null,null,"Cleveland"]
["Lincoln, NE",0.88759999999999994,"99928","Nebraska",null,"NE","Lincoln",null,null,"Lincoln"]
["Logan, NE",0.88759999999999994,"99928","Nebraska",null,"NE","Logan",null,null,"Polk"]
["Loup, NE",0.88759999999999994,"99928","Nebraska",null,"NE","Loup",null,null,"Union"]
["Mc Pherson, NE",0.88759999999999994,"99928","Nebraska",null,"NE","Mc Pherson",null,null,"Orange"]
["Madison, NE",0.88759999999999994,"99928","Nebraska",null,"NE","Madison",null,null,"Martin"]
["Merrick, NE",0.95850000000000002,"24260","Grand Island, NE",null,"NE","Merrick",null,null,"Burke"]
["Morrill, NE",0.88759999999999994,"99928","Nebraska",null,"NE","Morrill",null,null,"Camden"]
["Nance, NE",0.88759999999999994,"99928","Nebraska",null,"NE","Nance",null,null,"Chatham"]
["Nemaha, NE",0.88759999999999994,"99928","Nebraska",null,"NE","Nemaha",null,null,"Forsyth"]
["Nuckolls, NE",0.88759999999999994,"99928","Nebraska",null,"NE","Nuckolls",null,null,"Jones"]
["Otoe, NE",0.88759999999999994,"99928","Nebraska",null,"NE","Otoe",null,null,"Mitchell"]
["Pawnee, NE",0.88759999999999994,"99928","Nebraska",null,"NE","Pawnee",null,null,"Richmond"]
["Perkins, NE",0.88759999999999994,"99928","Nebraska",null,"NE","Perkins",null,null,"Warren"]
["Phelps, NE",0.88759999999999994,"99928","Nebraska",null,"NE","Phelps",null,null,"Wayne"]
["Pierce, NE",0.88759999999999994,"99928","Nebraska",null,"NE","Pierce",null,null,"Wilkes"]
["Platte, NE",0.88759999999999994,"99928","Nebraska",null,"NE","Platte",null,null,"Alexander"]
["Polk, NE",0.88759999999999994,"99928","Nebraska",null,"NE","Polk",null,null,"Cumberland"]
["Red Willow, NE",0.88759999999999994,"99928","Nebraska",null,"NE","Red Willow",null,null,"Henderson"]
["Richardson, NE",0.88759999999999994,"99928","Nebraska",null,"NE","Richardson",null,null,"Wilson"]
["Rock, NE",0.88759999999999994,"99928","Nebraska",null,"NE","Rock",null,null,"Caldwell"]
["Saline, NE",0.88759999999999994,"99928","Nebraska",null,"NE","Saline",null,null,"Rowan"]
["Sarpy, NE",0.95050000000000001,"36540","Omaha-Council Bluffs, NE-IA",null,"NE","Sarpy",null,null,"Scotland"]
["Saunders, NE",0.95050000000000001,"36540","Omaha-Council Bluffs, NE-IA",null,"NE","Saunders",null,null,"Rockingham"]
["Scott Bluff, NE",0.88759999999999994,"99928","Nebraska",null,"NE","Scott Bluff",null,null,"Alamance"]
["Seward, NE",0.97440000000000004,"30700","Lincoln, NE",null,"NE","Seward",null,null,"Alleghany"]
["Sheridan, NE",0.88759999999999994,"99928","Nebraska",null,"NE","Sheridan",null,null,"Anson"]
["Sherman, NE",0.88759999999999994,"99928","Nebraska",null,"NE","Sherman",null,null,"Ashe"]
["Sioux, NE",0.88759999999999994,"99928","Nebraska",null,"NE","Sioux",null,null,"Avery"]
["Stanton, NE",0.88759999999999994,"99928","Nebraska",null,"NE","Stanton",null,null,"Beaufort"]
["Thayer, NE",0.88759999999999994,"99928","Nebraska",null,"NE","Thayer",null,null,"Bertie"]
["Thomas, NE",0.88759999999999994,"99928","Nebraska",null,"NE","Thomas",null,null,"Bladen"]
["Thurston, NE",0.88759999999999994,"99928","Nebraska",null,"NE","Thurston",null,null,"Brunswick"]
["Valley, NE",0.88759999999999994,"99928","Nebraska",null,"NE","Valley",null,null,"Buncombe"]
["Washington, NE",0.95050000000000001,"36540","Omaha-Council Bluffs, NE-IA",null,"NE","Washington",null,null,"Cabarrus"]
["Wayne, NE",0.88759999999999994,"99928","Nebraska",null,"NE","Wayne",null,null,"Carteret"]
["Webster, NE",0.88759999999999994,"99928","Nebraska",null,"NE","Webster",null,null,"Caswell"]
["Wheeler, NE",0.88759999999999994,"99928","Nebraska",null,"NE","Wheeler",null,null,"Catawba"]
["York, NE",0.88759999999999994,"99928","Nebraska",null,"NE","York",null,null,"Chowan"]
["Churchill, NV",1.0647,"99929","Nevada",null,"NV","Churchill",null,null,"Columbus"]
["Clark, NV",1.1825000000000001,"29820","Las Vegas-Henderson-Paradise, NV",null,"NV","Clark",null,null,"Craven"]
["Douglas, NV",1.0647,"99929","Nevada",null,"NV","Douglas",null,null,"Currituck"]
["Elko, NV",1.0647,"99929","Nevada",null,"NV","Elko",null,null,"Dare"]
["Esmeralda, NV",1.0647,"99929","Nevada",null,"NV","Esmeralda",null,null,"Davidson"]
["Eureka, NV",1.0647,"99929","Nevada",null,"NV","Eureka",null,null,"Davie"]
["Humboldt, NV",1.0647,"99929","Nevada",null,"NV","Humboldt",null,null,"Duplin"]
["Lander, NV",1.0647,"99929","Nevada",null,"NV","Lander",null,null,"Durham"]
["Lincoln, NV",1.0647,"99929","Nevada",null,"NV","Lincoln",null,null,"Edgecombe"]
["Lyon, NV",1.0647,"99929","Nevada",null,"NV","Lyon",null,null,"Gaston"]
["Mineral, NV",1.0647,"99929","Nevada",null,"NV","Mineral",null,null,"Gates"]
["Nye, NV",1.0647,"99929","Nevada",null,"NV","Nye",null,null,"Granville"]
["Carson City, NV",0.99009999999999998,"16180","Carson City, NV",null,"NV","Carson City",null,null,"Guilford"]
["Pershing, NV",1.0647,"99929","Nevada",null,"NV","Pershing",null,null,"Halifax"]
["Storey, NV",0.9335,"39900","Reno, NV",null,"NV","Storey",null,null,"Harnett"]
["Washoe, NV",0.9335,"39900","Reno, NV",null,"NV","Washoe",null,null,"Haywood"]
["White Pine, NV",1.0647,"99929","Nevada",null,"NV","White Pine",null,null,"Hertford"]
["Belknap, NH",1.0141,"99930","New Hampshire",null,"NH","Belknap",null,null,"Hoke"]
["Carroll, NH",1.0141,"99930","New Hampshire",null,"NH","Carroll",null,null,"Hyde"]
["Cheshire, NH",1.0141,"99930","New Hampshire",null,"NH","Cheshire",null,null,"Iredell"]
["Coos, NH",1.0141,"99930","New Hampshire",null,"NH","Coos",null,null,"Johnston"]
["Grafton, NH",1.0141,"99930","New Hampshire",null,"NH","Grafton",null,null,"Lenoir"]
["Hillsborough, NH",0.92710000000000004,"31700","Manchester-Nashua, NH",null,"NH","Hillsborough",null,null,"Mc Dowell"]
["Merrimack, NH",1.0141,"99930","New Hampshire",null,"NH","Merrimack",null,null,"Mecklenburg"]
["Rockingham, NH",1.0286999999999999,"40484","Rockingham County-Strafford County, NH",null,"NH","Rockingham",null,null,"Moore"]
["Strafford, NH",1.0286999999999999,"40484","Rockingham County-Strafford County, NH",null,"NH","Strafford",null,null,"Nash"]
["Sullivan, NH",1.0141,"99930","New Hampshire",null,"NH","Sullivan",null,null,"New Hanover"]
["Atlantic, NJ",1.1734,"12100","Atlantic City-Hammonton, NJ",null,"NJ","Atlantic",null,null,"Northampton"]
["Bergen, NJ",1.3384,"35614","New York-Jersey City-White Plains, NY-NJ",null,"NJ","Bergen",null,null,"Onslow"]
["Burlington, NJ",1.0941000000000001,"15804","Camden, NJ",null,"NJ","Burlington",null,null,"Pamlico"]
["Camden, NJ",1.0941000000000001,"15804","Camden, NJ",null,"NJ","Camden",null,null,"Pasquotank"]
["Cape May, NJ",1.0588,"36140","Ocean City, NJ",null,"NJ","Cape May",null,null,"Pender"]
["Cumberland, NJ",1.1087,"47220","Vineland-Bridgeton, NJ",null,"NJ","Cumberland",null,null,"Perquimans"]
["Essex, NJ",1.1142000000000001,"35084","Newark, NJ-PA",null,"NJ","Essex",null,null,"Person"]
["Gloucester, NJ",1.0941000000000001,"15804","Camden, NJ",null,"NJ","Gloucester",null,null,"Pitt"]
["Hudson, NJ",1.3384,"35614","New York-Jersey City-White Plains, NY-NJ",null,"NJ","Hudson",null,null,"Robeson"]
["Hunterdon, NJ",1.1142000000000001,"35084","Newark, NJ-PA",null,"NJ","Hunterdon",null,null,"Rutherford"]
["Mercer, NJ",1.0358000000000001,"45940","Trenton-Princeton, NJ",null,"NJ","Mercer",null,null,"Sampson"]
["Middlesex, NJ",1.2108000000000001,"35154","New Brunswick-Lakewood, NJ",null,"NJ","Middlesex",null,null,"Stanly"]
["Monmouth, NJ",1.2108000000000001,"35154","New Brunswick-Lakewood, NJ",null,"NJ","Monmouth",null,null,"Stokes"]
["Morris, NJ",1.1142000000000001,"35084","Newark, NJ-PA",null,"NJ","Morris",null,null,"Surry"]
["Ocean, NJ",1.2108000000000001,"35154","New Brunswick-Lakewood, NJ",null,"NJ","Ocean",null,null,"Swain"]
["Passaic, NJ",1.3384,"35614","New York-Jersey City-White Plains, NY-NJ",null,"NJ","Passaic",null,null,"Transylvania"]
["Salem, NJ",1.0928,"48864","Wilmington, DE-MD-NJ",null,"NJ","Salem",null,null,"Tyrrell"]
["Somerset, NJ",1.0623,"35154","New Brunswick-Lakewood, NJ",null,"NJ","Somerset",null,null,"Vance"]
["Sussex, NJ",1.1142000000000001,"35084","Newark, NJ-PA",null,"NJ","Sussex",null,null,"Wake"]
["Union, NJ",1.1142000000000001,"35084","Newark, NJ-PA",null,"NJ","Union",null,null,"Watauga"]
["Warren, NJ",0.95009999999999994,"10900","Allentown-Bethlehem-Easton, PA-NJ",null,"NJ","Warren",null,null,"Yadkin"]
["Bernalillo, NM",0.86990000000000001,"10740","Albuquerque, NM",null,"NM","Bernalillo",null,null,"Yancey"]
["Catron, NM",0.87009999999999998,"99932","New Mexico",null,"NM","Catron",null,"CA","Santa Cruz"]
["Chaves, NM",0.87009999999999998,"99932","New Mexico",null,"NM","Chaves",null,null,"Nevada"]
["Cibola, NM",0.87009999999999998,"99932","New Mexico",null,"NM","Cibola",null,null,"Alameda"]
["Colfax, NM",0.87009999999999998,"99932","New Mexico",null,"NM","Colfax",null,null,"Alpine"]
["Curry, NM",0.87009999999999998,"99932","New Mexico",null,"NM","Curry",null,null,"Amador"]
["De Baca, NM",0.87009999999999998,"99932","New Mexico",null,"NM","De Baca",null,null,"Butte"]
["Dona Ana, NM",0.90280000000000005,"29740","Las Cruces, NM",null,"NM","Dona Ana",null,null,"Calaveras"]
["Eddy, NM",0.87009999999999998,"99932","New Mexico",null,"NM","Eddy",null,null,"Colusa"]
["Grant, NM",0.87009999999999998,"99932","New Mexico",null,"NM","Grant",null,null,"Contra Costa"]
["Guadalupe, NM",0.87009999999999998,"99932","New Mexico",null,"NM","Guadalupe",null,null,"Del Norte"]
["Harding, NM",0.87009999999999998,"99932","New Mexico",null,"NM","Harding",null,null,"El Dorado"]
["Hidalgo, NM",0.87009999999999998,"99932","New Mexico",null,"NM","Hidalgo",null,null,"Fresno"]
["Lea, NM",0.87009999999999998,"99932","New Mexico",null,"NM","Lea",null,null,"Glenn"]
["Lincoln, NM",0.87009999999999998,"99932","New Mexico",null,"NM","Lincoln",null,null,"Humboldt"]
["Los Alamos, NM",0.87009999999999998,"99932","New Mexico",null,"NM","Los Alamos",null,null,"Imperial"]
["Luna, NM",0.87009999999999998,"99932","New Mexico",null,"NM","Luna",null,null,"Inyo"]
["Mckinley, NM",0.87009999999999998,"99932","New Mexico",null,"NM","Mckinley",null,null,"Kern"]
["Mora, NM",0.87009999999999998,"99932","New Mexico",null,"NM","Mora",null,null,"Kings"]
["Otero, NM",0.87009999999999998,"99932","New Mexico",null,"NM","Otero",null,null,"Lake"]
["Quay, NM",0.87009999999999998,"99932","New Mexico",null,"NM","Quay",null,null,"Lassen"]
["Rio Arriba, NM",0.87009999999999998,"99932","New Mexico",null,"NM","Rio Arriba",null,null,"Los Angeles"]
["Roosevelt, NM",0.87009999999999998,"99932","New Mexico",null,"NM","Roosevelt",null,null,"Madera"]
["Sandoval, NM",0.86990000000000001,"10740","Albuquerque, NM",null,"NM","Sandoval",null,null,"Marin"]
["San Juan, NM",0.91100000000000003,"22140","Farmington, NM",null,"NM","San Juan",null,null,"Mariposa"]
["San Miguel, NM",0.87009999999999998,"99932","New Mexico",null,"NM","San Miguel",null,null,"Mendocino"]
["Santa Fe, NM",1.0531999999999999,"42140","Santa Fe, NM",null,"NM","Santa Fe",null,null,"Merced"]
["Sierra, NM",0.87009999999999998,"99932","New Mexico",null,"NM","Sierra",null,null,"Modoc"]
["Socorro, NM",0.87009999999999998,"99932","New Mexico",null,"NM","Socorro",null,null,"Mono"]
["Taos, NM",0.87009999999999998,"99932","New Mexico",null,"NM","Taos",null,null,"Monterey"]
["Torrance, NM",0.86990000000000001,"10740","Albuquerque, NM",null,"NM","Torrance",null,null,"Napa"]
["Union, NM",0.87009999999999998,"99932","New Mexico",null,"NM","Union",null,null,"Orange"]
["Valencia, NM",0.86990000000000001,"10740","Albuquerque, NM",null,"NM","Valencia",null,null,"Placer"]
["Albany, NY",0.82589999999999997,"10580","Albany-Schenectady-Troy, NY",null,"NY","Albany",null,null,"Plumas"]
["Allegany, NY",0.85950000000000004,"99933","New York",null,"NY","Allegany",null,null,"Riverside"]
["Bronx, NY",1.3384,"35614","New York-Jersey City-White Plains, NY-NJ",null,"NY","Bronx",null,null,"Sacramento"]
["Broome, NY",0.83430000000000004,"13780","Binghamton, NY",null,"NY","Broome",null,null,"San Benito"]
["Cattaraugus, NY",0.85950000000000004,"99933","New York",null,"NY","Cattaraugus",null,null,"San Bernardino"]
["Cayuga, NY",0.85950000000000004,"99933","New York",null,"NY","Cayuga",null,null,"San Diego"]
["Chautauqua, NY",0.85950000000000004,"99933","New York",null,"NY","Chautauqua",null,null,"San Francisco"]
["Chemung, NY",0.871,"21300","Elmira, NY",null,"NY","Chemung",null,null,"San Joaquin"]
["Chenango, NY",0.85950000000000004,"99933","New York",null,"NY","Chenango",null,null,"San Luis Obispo"]
["Clinton, NY",0.85950000000000004,"99933","New York",null,"NY","Clinton",null,null,"San Mateo"]
["Columbia, NY",0.85950000000000004,"99933","New York",null,"NY","Columbia",null,null,"Santa Barbara"]
["Cortland, NY",0.85950000000000004,"99933","New York",null,"NY","Cortland",null,null,"Santa Clara"]
["Delaware, NY",0.85950000000000004,"99933","New York",null,"NY","Delaware",null,null,"Shasta"]
["Dutchess, NY",1.2045999999999999,"39100","Poughkeepsie-Newburgh-Middletown, NY",null,"NY","Dutchess",null,null,"Sierra"]
["Erie, NY",1.0442,"15380","Buffalo-Cheektowaga, NY",null,"NY","Erie",null,null,"Siskiyou"]
["Essex, NY",0.85950000000000004,"99933","New York",null,"NY","Essex",null,null,"Solano"]
["Franklin, NY",0.85950000000000004,"99933","New York",null,"NY","Franklin",null,null,"Sonoma"]
["Fulton, NY",0.85950000000000004,"99933","New York",null,"NY","Fulton",null,null,"Stanislaus"]
["Genesee, NY",0.85950000000000004,"99933","New York",null,"NY","Genesee",null,null,"Sutter"]
["Greene, NY",0.85950000000000004,"99933","New York",null,"NY","Greene",null,null,"Tehama"]
["Hamilton, NY",0.85950000000000004,"99933","New York",null,"NY","Hamilton",null,null,"Trinity"]
["Herkimer, NY",0.90259999999999996,"46540","Utica-Rome, NY",null,"NY","Herkimer",null,null,"Tulare"]
["Jefferson, NY",0.88759999999999994,"48060","Watertown-Fort Drum, NY",null,"NY","Jefferson",null,null,"Tuolumne"]
["Kings, NY",1.3384,"35614","New York-Jersey City-White Plains, NY-NJ",null,"NY","Kings",null,null,"Ventura"]
["Lewis, NY",0.85950000000000004,"99933","New York",null,"NY","Lewis",null,null,"Yolo"]
["Livingston, NY",0.89219999999999999,"40380","Rochester, NY",null,"NY","Livingston",null,null,"Yuba"]
["Madison, NY",0.9859,"45060","Syracuse, NY",null,"NY","Madison",null,"NY","Franklin"]
["Monroe, NY",0.89219999999999999,"40380","Rochester, NY",null,"NY","Monroe",null,null,"Greene"]
["Montgomery, NY",0.85950000000000004,"99933","New York",null,"NY","Montgomery",null,null,"Jefferson"]
["Nassau, NY",1.3088,"35004","Nassau County-Suffolk County, NY",null,"NY","Nassau",null,null,"Madison"]
["New York, NY",1.3384,"35614","New York-Jersey City-White Plains, NY-NJ",null,"NY","New York",null,null,"Monroe"]
["Niagara, NY",1.0442,"15380","Buffalo-Cheektowaga, NY",null,"NY","Niagara",null,null,"Montgomery"]
["Oneida, NY",0.90259999999999996,"46540","Utica-Rome, NY",null,"NY","Oneida",null,null,"Washington"]
["Onondaga, NY",0.9859,"45060","Syracuse, NY",null,"NY","Onondaga",null,null,"Columbia"]
["Ontario, NY",0.89219999999999999,"40380","Rochester, NY",null,"NY","Ontario",null,null,"Fulton"]
["Orange, NY",1.2108000000000001,"39100","Poughkeepsie-Newburgh-Middletown, NY",null,"NY","Orange",null,null,"Kings"]
["Orleans, NY",0.89219999999999999,"40380","Rochester, NY",null,"NY","Orleans",null,null,"Orange"]
["Oswego, NY",0.9859,"45060","Syracuse, NY",null,"NY","Oswego",null,null,"Hamilton"]
["Otsego, NY",0.85950000000000004,"99933","New York",null,"NY","Otsego",null,null,"Nassau"]
["Putnam, NY",1.3384,"35614","New York-Jersey City-White Plains, NY-NJ",null,"NY","Putnam",null,null,"Putnam"]
["Queens, NY",1.3384,"35614","New York-Jersey City-White Plains, NY-NJ",null,"NY","Queens",null,null,"Richmond"]
["Rensselaer, NY",0.82589999999999997,"10580","Albany-Schenectady-Troy, NY",null,"NY","Rensselaer",null,null,"Warren"]
["Richmond, NY",1.3384,"35614","New York-Jersey City-White Plains, NY-NJ",null,"NY","Richmond",null,null,"Wayne"]
["Rockland, NY",1.3384,"35614","New York-Jersey City-White Plains, NY-NJ",null,"NY","Rockland",null,null,"Lewis"]
["St. Lawrence, NY",0.85950000000000004,"99933","New York",null,"NY","St. Lawrence",null,null,"Oneida"]
["Saratoga, NY",0.82589999999999997,"10580","Albany-Schenectady-Troy, NY",null,"NY","Saratoga",null,null,"Clinton"]
["Schenectady, NY",0.82589999999999997,"10580","Albany-Schenectady-Troy, NY",null,"NY","Schenectady",null,null,"Livingston"]
["Schoharie, NY",0.82589999999999997,"10580","Albany-Schenectady-Troy, NY",null,"NY","Schoharie",null,null,"Schuyler"]
["Schuyler, NY",0.85950000000000004,"99933","New York",null,"NY","Schuyler",null,null,"Delaware"]
["Seneca, NY",0.85950000000000004,"99933","New York",null,"NY","Seneca",null,null,"Steuben"]
["Steuben, NY",0.85950000000000004,"99933","New York",null,"NY","Steuben",null,null,"Sullivan"]
["Suffolk, NY",1.3088,"35004","Nassau County-Suffolk County, NY",null,"NY","Suffolk",null,null,"Chautauqua"]
["Sullivan, NY",0.85950000000000004,"99933","New York",null,"NY","Sullivan",null,null,"Orleans"]
["Tioga, NY",0.83430000000000004,"13780","Binghamton, NY",null,"NY","Tioga",null,null,"Allegany"]
["Tompkins, NY",0.95469999999999999,"27060","Ithaca, NY",null,"NY","Tompkins",null,null,"Essex"]
["Ulster, NY",0.93059999999999998,"28740","Kingston, NY",null,"NY","Ulster",null,null,"Suffolk"]
["Warren, NY",0.77400000000000002,"24020","Glens Falls, NY",null,"NY","Warren",null,null,"Genesee"]
["Washington, NY",0.77400000000000002,"24020","Glens Falls, NY",null,"NY","Washington",null,null,"Otsego"]
["Wayne, NY",0.89219999999999999,"40380","Rochester, NY",null,"NY","Wayne",null,null,"Albany"]
["Westchester, NY",1.3384,"35614","New York-Jersey City-White Plains, NY-NJ",null,"NY","Westchester",null,null,"Bronx"]
["Wyoming, NY",0.85950000000000004,"99933","New York",null,"NY","Wyoming",null,null,"Broome"]
["Yates, NY",0.89219999999999999,"40380","Rochester, NY",null,"NY","Yates",null,null,"Cattaraugus"]
["Alamance, NC",0.86280000000000001,"15500","Burlington, NC",null,"NC","Alamance",null,null,"Cayuga"]
["Alexander, NC",0.86660000000000004,"25860","Hickory-Lenoir-Morganton, NC",null,"NC","Alexander",null,null,"Chemung"]
["Alleghany, NC",0.79259999999999997,"99934","North Carolina",null,"NC","Alleghany",null,null,"Chenango"]
["Anson, NC",0.93369999999999997,"16740","Charlotte-Concord-Gastonia, NC-SC",null,"NC","Anson",null,null,"Cortland"]
["Ashe, NC",0.79259999999999997,"99934","North Carolina",null,"NC","Ashe",null,null,"Dutchess"]
["Avery, NC",0.79259999999999997,"99934","North Carolina",null,"NC","Avery",null,null,"Erie"]
["Beaufort, NC",0.79259999999999997,"99934","North Carolina",null,"NC","Beaufort",null,null,"Herkimer"]
["Bertie, NC",0.79259999999999997,"99934","North Carolina",null,"NC","Bertie",null,null,"New York"]
["Bladen, NC",0.79259999999999997,"99934","North Carolina",null,"NC","Bladen",null,null,"Niagara"]
["Brunswick, NC",0.85350000000000004,"34820","Myrtle Beach-Conway-North Myrtle Beach, SC-NC",null,"NC","Brunswick",null,null,"Onondaga"]
["Buncombe, NC",0.87009999999999998,"11700","Asheville, NC",null,"NC","Buncombe",null,null,"Ontario"]
["Burke, NC",0.86660000000000004,"25860","Hickory-Lenoir-Morganton, NC",null,"NC","Burke",null,null,"Oswego"]
["Cabarrus, NC",0.93369999999999997,"16740","Charlotte-Concord-Gastonia, NC-SC",null,"NC","Cabarrus",null,null,"Queens"]
["Caldwell, NC",0.86660000000000004,"25860","Hickory-Lenoir-Morganton, NC",null,"NC","Caldwell",null,null,"Rensselaer"]
["Camden, NC",0.87960000000000005,"47260","Virginia Beach-Norfolk-Newport News, VA-NC",null,"NC","Camden",null,null,"Rockland"]
["Carteret, NC",0.79259999999999997,"99934","North Carolina",null,"NC","Carteret",null,null,"St. Lawrence"]
["Caswell, NC",0.79259999999999997,"99934","North Carolina",null,"NC","Caswell",null,null,"Saratoga"]
["Catawba, NC",0.86660000000000004,"25860","Hickory-Lenoir-Morganton, NC",null,"NC","Catawba",null,null,"Schenectady"]
["Chatham, NC",0.96579999999999999,"20500","Durham-Chapel Hill, NC",null,"NC","Chatham",null,null,"Schoharie"]
["Cherokee, NC",0.79259999999999997,"99934","North Carolina",null,"NC","Cherokee",null,null,"Seneca"]
["Chowan, NC",0.79259999999999997,"99934","North Carolina",null,"NC","Chowan",null,null,"Tioga"]
["Clay, NC",0.79259999999999997,"99934","North Carolina",null,"NC","Clay",null,null,"Tompkins"]
["Cleveland, NC",0.79259999999999997,"99934","North Carolina",null,"NC","Cleveland",null,null,"Ulster"]
["Columbus, NC",0.79259999999999997,"99934","North Carolina",null,"NC","Columbus",null,null,"Westchester"]
["Craven, NC",0.80979999999999996,"35100","New Bern, NC",null,"NC","Craven",null,null,"Wyoming"]
["Cumberland, NC",0.80120000000000002,"22180","Fayetteville, NC",null,"NC","Cumberland",null,null,"Yates"]
["Currituck, NC",0.87960000000000005,"47260","Virginia Beach-Norfolk-Newport News, VA-NC",null,"NC","Currituck",null,"WY","Johnson"]
["Dare, NC",0.79259999999999997,"99934","North Carolina",null,"NC","Dare",null,null,"Lincoln"]
["Davidson, NC",0.92490000000000006,"49180","Winston-Salem, NC",null,"NC","Davidson",null,null,"Fremont"]
["Davie, NC",0.92490000000000006,"49180","Winston-Salem, NC",null,"NC","Davie",null,null,"Park"]
["Duplin, NC",0.79259999999999997,"99934","North Carolina",null,"NC","Duplin",null,null,"Teton"]
["Durham, NC",0.96579999999999999,"20500","Durham-Chapel Hill, NC",null,"NC","Durham",null,null,"Sheridan"]
["Edgecombe, NC",0.82640000000000002,"40580","Rocky Mount, NC",null,"NC","Edgecombe",null,null,"Campbell"]
["Forsyth, NC",0.92490000000000006,"49180","Winston-Salem, NC",null,"NC","Forsyth",null,null,"Platte"]
["Franklin, NC",0.94259999999999999,"39580","Raleigh-Cary, NC",null,"NC","Franklin",null,null,"Big Horn"]
["Gaston, NC",0.93369999999999997,"16740","Charlotte-Concord-Gastonia, NC-SC",null,"NC","Gaston",null,null,"Carbon"]
["Gates, NC",0.87960000000000005,"47260","Virginia Beach-Norfolk-Newport News, VA-NC",null,"NC","Gates",null,null,"Albany"]
["Graham, NC",0.79259999999999997,"99934","North Carolina",null,"NC","Graham",null,null,"Crook"]
["Granville, NC",0.96579999999999999,"20500","Durham-Chapel Hill, NC",null,"NC","Granville",null,null,"Converse"]
["Greene, NC",0.79259999999999997,"99934","North Carolina",null,"NC","Greene",null,null,"Goshen"]
["Guilford, NC",0.91210000000000002,"24660","Greensboro-High Point, NC",null,"NC","Guilford",null,null,"Hot Springs"]
["Halifax, NC",0.79259999999999997,"99934","North Carolina",null,"NC","Halifax",null,null,"Laramie"]
["Harnett, NC",0.78220000000000001,"22180","Fayetteville, NC",null,"NC","Harnett",null,null,"Natrona"]
["Haywood, NC",0.87009999999999998,"11700","Asheville, NC",null,"NC","Haywood",null,null,"Niobrara"]
["Henderson, NC",0.87009999999999998,"11700","Asheville, NC",null,"NC","Henderson",null,null,"Sublette"]
["Hertford, NC",0.79259999999999997,"99934","North Carolina",null,"NC","Hertford",null,null,"Sweetwater"]
["Hoke, NC",0.80120000000000002,"22180","Fayetteville, NC",null,"NC","Hoke",null,null,"Uinta"]
["Hyde, NC",0.79259999999999997,"99934","North Carolina",null,"NC","Hyde",null,null,"Washakie"]
["Iredell, NC",0.93369999999999997,"16740","Charlotte-Concord-Gastonia, NC-SC",null,"NC","Iredell",null,null,"Weston"]
["Jackson, NC",0.79259999999999997,"99934","North Carolina",null,"NC","Jackson",null,"MI","Calhoun"]
["Johnston, NC",0.94259999999999999,"39580","Raleigh-Cary, NC",null,"NC","Johnston",null,null,"Jackson"]
["Jones, NC",0.80979999999999996,"35100","New Bern, NC",null,"NC","Jones",null,null,"Monroe"]
["Lee, NC",0.79259999999999997,"99934","North Carolina",null,"NC","Lee",null,null,"St. Clair"]
["Lenoir, NC",0.79259999999999997,"99934","North Carolina",null,"NC","Lenoir",null,null,"Crawford"]
["Lincoln, NC",0.93369999999999997,"16740","Charlotte-Concord-Gastonia, NC-SC",null,"NC","Lincoln",null,null,"Van Buren"]
["Mc Dowell, NC",0.79259999999999997,"99934","North Carolina",null,"NC","Mc Dowell",null,null,"Lake"]
["Macon, NC",0.79259999999999997,"99934","North Carolina",null,"NC","Macon",null,null,"Delta"]
["Madison, NC",0.87009999999999998,"11700","Asheville, NC",null,"NC","Madison",null,null,"Kent"]
["Martin, NC",0.79259999999999997,"99934","North Carolina",null,"NC","Martin",null,null,"Bay"]
["Mecklenburg, NC",0.93369999999999997,"16740","Charlotte-Concord-Gastonia, NC-SC",null,"NC","Mecklenburg",null,null,"Osceola"]
["Mitchell, NC",0.79259999999999997,"99934","North Carolina",null,"NC","Mitchell",null,null,"Berrien"]
["Montgomery, NC",0.79259999999999997,"99934","North Carolina",null,"NC","Montgomery",null,null,"Wayne"]
["Moore, NC",0.79259999999999997,"99934","North Carolina",null,"NC","Moore",null,null,"Cass"]
["Nash, NC",0.82640000000000002,"40580","Rocky Mount, NC",null,"NC","Nash",null,null,"Clinton"]
["New Hanover, NC",0.8891,"48900","Wilmington, NC",null,"NC","New Hanover",null,null,"Livingston"]
["Northampton, NC",0.79259999999999997,"99934","North Carolina",null,"NC","Northampton",null,null,"Mason"]
["Onslow, NC",0.78220000000000001,"27340","Jacksonville, NC",null,"NC","Onslow",null,null,"St. Joseph"]
["Orange, NC",0.96579999999999999,"20500","Durham-Chapel Hill, NC",null,"NC","Orange",null,null,"Dickinson"]
["Pamlico, NC",0.80979999999999996,"35100","New Bern, NC",null,"NC","Pamlico",null,null,"Emmet"]
["Pasquotank, NC",0.79259999999999997,"99934","North Carolina",null,"NC","Pasquotank",null,null,"Ottawa"]
["Pender, NC",0.8891,"48900","Wilmington, NC",null,"NC","Pender",null,null,"Alcona"]
["Perquimans, NC",0.79259999999999997,"99934","North Carolina",null,"NC","Perquimans",null,null,"Alger"]
["Person, NC",0.96579999999999999,"20500","Durham-Chapel Hill, NC",null,"NC","Person",null,null,"Allegan"]
["Pitt, NC",0.91830000000000001,"24780","Greenville, NC",null,"NC","Pitt",null,null,"Alpena"]
["Polk, NC",0.79259999999999997,"99934","North Carolina",null,"NC","Polk",null,null,"Antrim"]
["Randolph, NC",0.91210000000000002,"24660","Greensboro-High Point, NC",null,"NC","Randolph",null,null,"Arenac"]
["Richmond, NC",0.79259999999999997,"99934","North Carolina",null,"NC","Richmond",null,null,"Baraga"]
["Robeson, NC",0.79259999999999997,"99934","North Carolina",null,"NC","Robeson",null,null,"Barry"]
["Rockingham, NC",0.91210000000000002,"24660","Greensboro-High Point, NC",null,"NC","Rockingham",null,null,"Benzie"]
["Rowan, NC",0.93369999999999997,"16740","Charlotte-Concord-Gastonia, NC-SC",null,"NC","Rowan",null,null,"Branch"]
["Rutherford, NC",0.79259999999999997,"99934","North Carolina",null,"NC","Rutherford",null,null,"Charlevoix"]
["Sampson, NC",0.79259999999999997,"99934","North Carolina",null,"NC","Sampson",null,null,"Cheboygan"]
["Scotland, NC",0.79259999999999997,"99934","North Carolina",null,"NC","Scotland",null,null,"Chippewa"]
["Stanly, NC",0.79259999999999997,"99934","North Carolina",null,"NC","Stanly",null,null,"Clare"]
["Stokes, NC",0.92490000000000006,"49180","Winston-Salem, NC",null,"NC","Stokes",null,null,"Eaton"]
["Surry, NC",0.79259999999999997,"99934","North Carolina",null,"NC","Surry",null,null,"Genesee"]
["Swain, NC",0.79259999999999997,"99934","North Carolina",null,"NC","Swain",null,null,"Gladwin"]
["Transylvania, NC",0.79259999999999997,"99934","North Carolina",null,"NC","Transylvania",null,null,"Gogebic"]
["Tyrrell, NC",0.79259999999999997,"99934","North Carolina",null,"NC","Tyrrell",null,null,"Grand Traverse"]
["Union, NC",0.93369999999999997,"16740","Charlotte-Concord-Gastonia, NC-SC",null,"NC","Union",null,null,"Gratiot"]
["Vance, NC",0.79259999999999997,"99934","North Carolina",null,"NC","Vance",null,null,"Hillsdale"]
["Wake, NC",0.94259999999999999,"39580","Raleigh-Cary, NC",null,"NC","Wake",null,null,"Houghton"]
["Warren, NC",0.79259999999999997,"99934","North Carolina",null,"NC","Warren",null,null,"Huron"]
["Washington, NC",0.79259999999999997,"99934","North Carolina",null,"NC","Washington",null,null,"Ingham"]
["Watauga, NC",0.79259999999999997,"99934","North Carolina",null,"NC","Watauga",null,null,"Ionia"]
["Wayne, NC",0.90590000000000004,"24140","Goldsboro, NC",null,"NC","Wayne",null,null,"Iosco"]
["Wilkes, NC",0.79259999999999997,"99934","North Carolina",null,"NC","Wilkes",null,null,"Iron"]
["Wilson, NC",0.79259999999999997,"99934","North Carolina",null,"NC","Wilson",null,null,"Isabella"]
["Yadkin, NC",0.92490000000000006,"49180","Winston-Salem, NC",null,"NC","Yadkin",null,null,"Kalamazoo"]
["Yancey, NC",0.79259999999999997,"99934","North Carolina",null,"NC","Yancey",null,null,"Kalkaska"]
["Adams, ND",0.83679999999999999,"99935","North Dakota",null,"ND","Adams",null,null,"Keweenaw"]
["Barnes, ND",0.83679999999999999,"99935","North Dakota",null,"ND","Barnes",null,null,"Lapeer"]
["Benson, ND",0.83679999999999999,"99935","North Dakota",null,"ND","Benson",null,null,"Leelanau"]
["Billings, ND",0.83679999999999999,"99935","North Dakota",null,"ND","Billings",null,null,"Lenawee"]
["Bottineau, ND",0.83679999999999999,"99935","North Dakota",null,"ND","Bottineau",null,null,"Luce"]
["Bowman, ND",0.83679999999999999,"99935","North Dakota",null,"ND","Bowman",null,null,"Mackinac"]
["Burke, ND",0.83679999999999999,"99935","North Dakota",null,"ND","Burke",null,null,"Macomb"]
["Burleigh, ND",0.85640000000000005,"13900","Bismarck, ND",null,"ND","Burleigh",null,null,"Manistee"]
["Cass, ND",0.80269999999999997,"22020","Fargo, ND-MN",null,"ND","Cass",null,null,"Marquette"]
["Cavalier, ND",0.83679999999999999,"99935","North Dakota",null,"ND","Cavalier",null,null,"Mecosta"]
["Dickey, ND",0.83679999999999999,"99935","North Dakota",null,"ND","Dickey",null,null,"Menominee"]
["Divide, ND",0.83679999999999999,"99935","North Dakota",null,"ND","Divide",null,null,"Midland"]
["Dunn, ND",0.83679999999999999,"99935","North Dakota",null,"ND","Dunn",null,null,"Missaukee"]
["Eddy, ND",0.83679999999999999,"99935","North Dakota",null,"ND","Eddy",null,null,"Montcalm"]
["Emmons, ND",0.83679999999999999,"99935","North Dakota",null,"ND","Emmons",null,null,"Montmorency"]
["Foster, ND",0.83679999999999999,"99935","North Dakota",null,"ND","Foster",null,null,"Muskegon"]
["Golden Valley, ND",0.83679999999999999,"99935","North Dakota",null,"ND","Golden Valley",null,null,"Newaygo"]
["Grand Forks, ND",0.84160000000000001,"24220","Grand Forks, ND-MN",null,"ND","Grand Forks",null,null,"Oakland"]
["Grant, ND",0.83679999999999999,"99935","North Dakota",null,"ND","Grant",null,null,"Oceana"]
["Griggs, ND",0.83679999999999999,"99935","North Dakota",null,"ND","Griggs",null,null,"Ogemaw"]
["Hettinger, ND",0.83679999999999999,"99935","North Dakota",null,"ND","Hettinger",null,null,"Ontonagon"]
["Kidder, ND",0.83679999999999999,"99935","North Dakota",null,"ND","Kidder",null,null,"Oscoda"]
["La Moure, ND",0.83679999999999999,"99935","North Dakota",null,"ND","La Moure",null,null,"Otsego"]
["Logan, ND",0.83679999999999999,"99935","North Dakota",null,"ND","Logan",null,null,"Presque Isle"]
["Mchenry, ND",0.83679999999999999,"99935","North Dakota",null,"ND","Mchenry",null,null,"Roscommon"]
["Mcintosh, ND",0.83679999999999999,"99935","North Dakota",null,"ND","Mcintosh",null,null,"Saginaw"]
["Mckenzie, ND",0.83679999999999999,"99935","North Dakota",null,"ND","Mckenzie",null,null,"Sanilac"]
["Mclean, ND",0.83679999999999999,"99935","North Dakota",null,"ND","Mclean",null,null,"Schoolcraft"]
["Mercer, ND",0.83679999999999999,"99935","North Dakota",null,"ND","Mercer",null,null,"Shiawassee"]
["Morton, ND",0.85640000000000005,"13900","Bismarck, ND",null,"ND","Morton",null,null,"Tuscola"]
["Mountrail, ND",0.83679999999999999,"99935","North Dakota",null,"ND","Mountrail",null,null,"Washtenaw"]
["Nelson, ND",0.83679999999999999,"99935","North Dakota",null,"ND","Nelson",null,null,"Wexford"]
["Oliver, ND",0.85640000000000005,"13900","Bismarck, ND",null,"ND","Oliver",null,"AK","Bristol Bay Borough"]
["Pembina, ND",0.83679999999999999,"99935","North Dakota",null,"ND","Pembina",null,null,"Hoonah-Angoon Census Area"]
["Pierce, ND",0.83679999999999999,"99935","North Dakota",null,"ND","Pierce",null,null,"Kodiak Island Borough"]
["Ramsey, ND",0.83679999999999999,"99935","North Dakota",null,"ND","Ramsey",null,null,"Northwest Artic Borough"]
["Ransom, ND",0.83679999999999999,"99935","North Dakota",null,"ND","Ransom",null,null,"Sitka Borough"]
["Renville, ND",0.83679999999999999,"99935","North Dakota",null,"ND","Renville",null,null,"Wrangell City And Borough"]
["Richland, ND",0.83679999999999999,"99935","North Dakota",null,"ND","Richland",null,null,"Yakutat Borough"]
["Rolette, ND",0.83679999999999999,"99935","North Dakota",null,"ND","Rolette",null,null,"Aleutians East"]
["Sargent, ND",0.83679999999999999,"99935","North Dakota",null,"ND","Sargent",null,null,"Aleutians West"]
["Sheridan, ND",0.83679999999999999,"99935","North Dakota",null,"ND","Sheridan",null,null,"Anchorage"]
["Sioux, ND",0.83679999999999999,"99935","North Dakota",null,"ND","Sioux",null,null,"Bethel"]
["Slope, ND",0.83679999999999999,"99935","North Dakota",null,"ND","Slope",null,null,"Denali"]
["Stark, ND",0.83679999999999999,"99935","North Dakota",null,"ND","Stark",null,null,"Dillingham"]
["Steele, ND",0.83679999999999999,"99935","North Dakota",null,"ND","Steele",null,null,"Fairbanks North Star"]
["Stutsman, ND",0.83679999999999999,"99935","North Dakota",null,"ND","Stutsman",null,null,"Haines"]
["Towner, ND",0.83679999999999999,"99935","North Dakota",null,"ND","Towner",null,null,"Juneau"]
["Traill, ND",0.83679999999999999,"99935","North Dakota",null,"ND","Traill",null,null,"Kenai Peninsula"]
["Walsh, ND",0.83679999999999999,"99935","North Dakota",null,"ND","Walsh",null,null,"Ketchikan Gateway"]
["Ward, ND",0.83679999999999999,"99935","North Dakota",null,"ND","Ward",null,null,"Lake And Peninsula"]
["Wells, ND",0.83679999999999999,"99935","North Dakota",null,"ND","Wells",null,null,"Matanuska-Susitna"]
["Williams, ND",0.83679999999999999,"99935","North Dakota",null,"ND","Williams",null,null,"Nome"]
["Adams, OH",0.80940000000000001,"99936","Ohio",null,"OH","Adams",null,null,"North Slope Borouh"]
["Allen, OH",0.86350000000000005,"30620","Lima, OH",null,"OH","Allen",null,null,"Petersburg Borough"]
["Ashland, OH",0.80940000000000001,"99936","Ohio",null,"OH","Ashland",null,null,"Pr.Of Wales-Hyder Cns Are"]
["Ashtabula, OH",0.80940000000000001,"99936","Ohio",null,"OH","Ashtabula",null,null,"Skagway-Yakutat"]
["Athens, OH",0.80940000000000001,"99936","Ohio",null,"OH","Athens",null,null,"Southeast Fairbanks"]
["Auglaize, OH",0.80940000000000001,"99936","Ohio",null,"OH","Auglaize",null,null,"Valdez-Cordova"]
["Belmont, OH",0.65980000000000005,"48540","Wheeling, WV-OH",null,"OH","Belmont",null,null,"Kusilvak Census Area"]
["Brown, OH",0.94610000000000005,"17140","Cincinnati, OH-KY-IN",null,"OH","Brown",null,null,"Yukon-Koyukuk"]
["Butler, OH",0.94610000000000005,"17140","Cincinnati, OH-KY-IN",null,"OH","Butler",null,"MD","Baltimore City"]
["Carroll, OH",0.81969999999999998,"15940","Canton-Massillon, OH",null,"OH","Carroll",null,null,"Montgomery"]
["Champaign, OH",0.80940000000000001,"99936","Ohio",null,"OH","Champaign",null,null,"Washington"]
["Clark, OH",0.91469999999999996,"44220","Springfield, OH",null,"OH","Clark",null,null,"Carroll"]
["Clermont, OH",0.94610000000000005,"17140","Cincinnati, OH-KY-IN",null,"OH","Clermont",null,null,"Howard"]
["Clinton, OH",0.80940000000000001,"99936","Ohio",null,"OH","Clinton",null,null,"Kent"]
["Columbiana, OH",0.80940000000000001,"99936","Ohio",null,"OH","Columbiana",null,null,"Talbot"]
["Coshocton, OH",0.80940000000000001,"99936","Ohio",null,"OH","Coshocton",null,null,"Somerset"]
["Crawford, OH",0.80940000000000001,"99936","Ohio",null,"OH","Crawford",null,null,"Allegany"]
["Cuyahoga, OH",0.88470000000000004,"17460","Cleveland-Elyria, OH",null,"OH","Cuyahoga",null,null,"Anne Arundel"]
["Darke, OH",0.80940000000000001,"99936","Ohio",null,"OH","Darke",null,null,"Baltimore"]
["Defiance, OH",0.80940000000000001,"99936","Ohio",null,"OH","Defiance",null,null,"Calvert"]
["Delaware, OH",0.9536,"18140","Columbus, OH",null,"OH","Delaware",null,null,"Caroline"]
["Erie, OH",0.80940000000000001,"99936","Ohio",null,"OH","Erie",null,null,"Cecil"]
["Fairfield, OH",0.9536,"18140","Columbus, OH",null,"OH","Fairfield",null,null,"Charles"]
["Fayette, OH",0.80940000000000001,"99936","Ohio",null,"OH","Fayette",null,null,"Dorchester"]
["Franklin, OH",0.9536,"18140","Columbus, OH",null,"OH","Franklin",null,null,"Frederick"]
["Fulton, OH",0.90129999999999999,"45780","Toledo, OH",null,"OH","Fulton",null,null,"Garrett"]
["Gallia, OH",0.80940000000000001,"99936","Ohio",null,"OH","Gallia",null,null,"Harford"]
["Geauga, OH",0.88470000000000004,"17460","Cleveland-Elyria, OH",null,"OH","Geauga",null,null,"Prince Georges"]
["Greene, OH",0.93279999999999996,"19430","Dayton-Kettering, OH",null,"OH","Greene",null,null,"Queen Annes"]
["Guernsey, OH",0.80940000000000001,"99936","Ohio",null,"OH","Guernsey",null,null,"St. Marys"]
["Hamilton, OH",0.94610000000000005,"17140","Cincinnati, OH-KY-IN",null,"OH","Hamilton",null,null,"Wicomico"]
["Hancock, OH",0.80940000000000001,"99936","Ohio",null,"OH","Hancock",null,null,"Worcester"]
["Hardin, OH",0.80940000000000001,"99936","Ohio",null,"OH","Hardin",null,"KS","Butler"]
["Harrison, OH",0.80940000000000001,"99936","Ohio",null,"OH","Harrison",null,null,"Cherokee"]
["Henry, OH",0.80940000000000001,"99936","Ohio",null,"OH","Henry",null,null,"Clay"]
["Highland, OH",0.80940000000000001,"99936","Ohio",null,"OH","Highland",null,null,"Franklin"]
["Hocking, OH",0.9536,"18140","Columbus, OH",null,"OH","Hocking",null,null,"Jackson"]
["Holmes, OH",0.80940000000000001,"99936","Ohio",null,"OH","Holmes",null,null,"Jefferson"]
["Huron, OH",0.80940000000000001,"99936","Ohio",null,"OH","Huron",null,null,"Marion"]
["Jackson, OH",0.80940000000000001,"99936","Ohio",null,"OH","Jackson",null,null,"Marshall"]
["Jefferson, OH",0.79810000000000003,"48260","Weirton-Steubenville, WV-OH",null,"OH","Jefferson",null,null,"Montgomery"]
["Knox, OH",0.80940000000000001,"99936","Ohio",null,"OH","Knox",null,null,"Russell"]
["Lake, OH",0.88470000000000004,"17460","Cleveland-Elyria, OH",null,"OH","Lake",null,null,"Washington"]
["Lawrence, OH",0.85050000000000003,"26580","Huntington-Ashland, WV-KY-OH",null,"OH","Lawrence",null,null,"Graham"]
["Licking, OH",0.9536,"18140","Columbus, OH",null,"OH","Licking",null,null,"Clark"]
["Logan, OH",0.80940000000000001,"99936","Ohio",null,"OH","Logan",null,null,"Crawford"]
["Lorain, OH",0.88470000000000004,"17460","Cleveland-Elyria, OH",null,"OH","Lorain",null,null,"Grant"]
["Lucas, OH",0.90129999999999999,"45780","Toledo, OH",null,"OH","Lucas",null,null,"Johnson"]
["Madison, OH",0.9536,"18140","Columbus, OH",null,"OH","Madison",null,null,"Lincoln"]
["Mahoning, OH",0.78879999999999995,"49660","Youngstown-Warren-Boardman, OH-PA",null,"OH","Mahoning",null,null,"Logan"]
["Marion, OH",0.80940000000000001,"99936","Ohio",null,"OH","Marion",null,null,"Phillips"]
["Medina, OH",0.88470000000000004,"17460","Cleveland-Elyria, OH",null,"OH","Medina",null,null,"Saline"]
["Meigs, OH",0.80940000000000001,"99936","Ohio",null,"OH","Meigs",null,null,"Scott"]
["Mercer, OH",0.80940000000000001,"99936","Ohio",null,"OH","Mercer",null,null,"Cheyenne"]
["Miami, OH",0.93279999999999996,"19430","Dayton-Kettering, OH",null,"OH","Miami",null,null,"Douglas"]
["Monroe, OH",0.80940000000000001,"99936","Ohio",null,"OH","Monroe",null,null,"Kiowa"]
["Montgomery, OH",0.93279999999999996,"19430","Dayton-Kettering, OH",null,"OH","Montgomery",null,null,"Sedgwick"]
["Morgan, OH",0.80940000000000001,"99936","Ohio",null,"OH","Morgan",null,null,"Hamilton"]
["Morrow, OH",0.9536,"18140","Columbus, OH",null,"OH","Morrow",null,null,"Decatur"]
["Muskingum, OH",0.80940000000000001,"99936","Ohio",null,"OH","Muskingum",null,null,"Mitchell"]
["Noble, OH",0.80940000000000001,"99936","Ohio",null,"OH","Noble",null,null,"Thomas"]
["Ottawa, OH",0.90129999999999999,"45780","Toledo, OH",null,"OH","Ottawa",null,null,"Brown"]
["Paulding, OH",0.80940000000000001,"99936","Ohio",null,"OH","Paulding",null,null,"Edwards"]
["Perry, OH",0.9536,"18140","Columbus, OH",null,"OH","Perry",null,null,"Ford"]
["Pickaway, OH",0.9536,"18140","Columbus, OH",null,"OH","Pickaway",null,null,"Allen"]
["Pike, OH",0.80940000000000001,"99936","Ohio",null,"OH","Pike",null,null,"Miami"]
["Portage, OH",0.82369999999999999,"10420","Akron, OH",null,"OH","Portage",null,null,"Rush"]
["Preble, OH",0.80940000000000001,"99936","Ohio",null,"OH","Preble",null,null,"Dickinson"]
["Putnam, OH",0.80940000000000001,"99936","Ohio",null,"OH","Putnam",null,null,"Linn"]
["Richland, OH",0.85619999999999996,"31900","Mansfield, OH",null,"OH","Richland",null,null,"Lyon"]
["Ross, OH",0.80940000000000001,"99936","Ohio",null,"OH","Ross",null,null,"Anderson"]
["Sandusky, OH",0.80940000000000001,"99936","Ohio",null,"OH","Sandusky",null,null,"Atchison"]
["Scioto, OH",0.80940000000000001,"99936","Ohio",null,"OH","Scioto",null,null,"Barber"]
["Seneca, OH",0.80940000000000001,"99936","Ohio",null,"OH","Seneca",null,null,"Barton"]
["Shelby, OH",0.80940000000000001,"99936","Ohio",null,"OH","Shelby",null,null,"Bourbon"]
["Stark, OH",0.81969999999999998,"15940","Canton-Massillon, OH",null,"OH","Stark",null,null,"Chase"]
["Summit, OH",0.82369999999999999,"10420","Akron, OH",null,"OH","Summit",null,null,"Chautauqua"]
["Trumbull, OH",0.78879999999999995,"49660","Youngstown-Warren-Boardman, OH-PA",null,"OH","Trumbull",null,null,"Cloud"]
["Tuscarawas, OH",0.80940000000000001,"99936","Ohio",null,"OH","Tuscarawas",null,null,"Coffey"]
["Union, OH",0.9536,"18140","Columbus, OH",null,"OH","Union",null,null,"Comanche"]
["Van Wert, OH",0.80940000000000001,"99936","Ohio",null,"OH","Van Wert",null,null,"Cowley"]
["Vinton, OH",0.80940000000000001,"99936","Ohio",null,"OH","Vinton",null,null,"Doniphan"]
["Warren, OH",0.94610000000000005,"17140","Cincinnati, OH-KY-IN",null,"OH","Warren",null,null,"Elk"]
["Washington, OH",0.80940000000000001,"99936","Ohio",null,"OH","Washington",null,null,"Ellis"]
["Wayne, OH",0.80940000000000001,"99936","Ohio",null,"OH","Wayne",null,null,"Ellsworth"]
["Williams, OH",0.80940000000000001,"99936","Ohio",null,"OH","Williams",null,null,"Finney"]
["Wood, OH",0.90129999999999999,"45780","Toledo, OH",null,"OH","Wood",null,null,"Geary"]
["Wyandot, OH",0.80940000000000001,"99936","Ohio",null,"OH","Wyandot",null,null,"Gove"]
["Adair, OK",0.77229999999999999,"99937","Oklahoma",null,"OK","Adair",null,null,"Gray"]
["Alfalfa, OK",0.77229999999999999,"99937","Oklahoma",null,"OK","Alfalfa",null,null,"Greeley"]
["Atoka, OK",0.77229999999999999,"99937","Oklahoma",null,"OK","Atoka",null,null,"Greenwood"]
["Beaver, OK",0.77229999999999999,"99937","Oklahoma",null,"OK","Beaver",null,null,"Harper"]
["Beckham, OK",0.77229999999999999,"99937","Oklahoma",null,"OK","Beckham",null,null,"Harvey"]
["Blaine, OK",0.77229999999999999,"99937","Oklahoma",null,"OK","Blaine",null,null,"Haskell"]
["Bryan, OK",0.77229999999999999,"99937","Oklahoma",null,"OK","Bryan",null,null,"Hodgeman"]
["Caddo, OK",0.77229999999999999,"99937","Oklahoma",null,"OK","Caddo",null,null,"Jewell"]
["Canadian, OK",0.89439999999999997,"36420","Oklahoma City, OK",null,"OK","Canadian",null,null,"Kearny"]
["Carter, OK",0.77229999999999999,"99937","Oklahoma",null,"OK","Carter",null,null,"Kingman"]
["Cherokee, OK",0.77229999999999999,"99937","Oklahoma",null,"OK","Cherokee",null,null,"Labette"]
["Choctaw, OK",0.77229999999999999,"99937","Oklahoma",null,"OK","Choctaw",null,null,"Lane"]
["Cimarron, OK",0.77229999999999999,"99937","Oklahoma",null,"OK","Cimarron",null,null,"Leavenworth"]
["Cleveland, OK",0.89439999999999997,"36420","Oklahoma City, OK",null,"OK","Cleveland",null,null,"Mcpherson"]
["Coal, OK",0.77229999999999999,"99937","Oklahoma",null,"OK","Coal",null,null,"Meade"]
["Comanche, OK",0.70660000000000001,"30020","Lawton, OK",null,"OK","Comanche",null,null,"Morris"]
["Cotton, OK",0.70660000000000001,"30020","Lawton, OK",null,"OK","Cotton",null,null,"Morton"]
["Craig, OK",0.77229999999999999,"99937","Oklahoma",null,"OK","Craig",null,null,"Nemaha"]
["Creek, OK",0.83650000000000002,"46140","Tulsa, OK",null,"OK","Creek",null,null,"Neosho"]
["Custer, OK",0.77229999999999999,"99937","Oklahoma",null,"OK","Custer",null,null,"Ness"]
["Delaware, OK",0.77229999999999999,"99937","Oklahoma",null,"OK","Delaware",null,null,"Norton"]
["Dewey, OK",0.77229999999999999,"99937","Oklahoma",null,"OK","Dewey",null,null,"Osage"]
["Ellis, OK",0.77229999999999999,"99937","Oklahoma",null,"OK","Ellis",null,null,"Osborne"]
["Garfield, OK",0.85799999999999998,"21420","Enid, OK",null,"OK","Garfield",null,null,"Ottawa"]
["Garvin, OK",0.77229999999999999,"99937","Oklahoma",null,"OK","Garvin",null,null,"Pawnee"]
["Grady, OK",0.89439999999999997,"36420","Oklahoma City, OK",null,"OK","Grady",null,null,"Pottawatomie"]
["Grant, OK",0.77229999999999999,"99937","Oklahoma",null,"OK","Grant",null,null,"Pratt"]
["Greer, OK",0.77229999999999999,"99937","Oklahoma",null,"OK","Greer",null,null,"Rawlins"]
["Harmon, OK",0.77229999999999999,"99937","Oklahoma",null,"OK","Harmon",null,null,"Reno"]
["Harper, OK",0.77229999999999999,"99937","Oklahoma",null,"OK","Harper",null,null,"Republic"]
["Haskell, OK",0.77229999999999999,"99937","Oklahoma",null,"OK","Haskell",null,null,"Rice"]
["Hughes, OK",0.77229999999999999,"99937","Oklahoma",null,"OK","Hughes",null,null,"Riley"]
["Jackson, OK",0.77229999999999999,"99937","Oklahoma",null,"OK","Jackson",null,null,"Rooks"]
["Jefferson, OK",0.77229999999999999,"99937","Oklahoma",null,"OK","Jefferson",null,null,"Seward"]
["Johnston, OK",0.77229999999999999,"99937","Oklahoma",null,"OK","Johnston",null,null,"Shawnee"]
["Kay, OK",0.77229999999999999,"99937","Oklahoma",null,"OK","Kay",null,null,"Sheridan"]
["Kingfisher, OK",0.77229999999999999,"99937","Oklahoma",null,"OK","Kingfisher",null,null,"Sherman"]
["Kiowa, OK",0.77229999999999999,"99937","Oklahoma",null,"OK","Kiowa",null,null,"Smith"]
["Latimer, OK",0.77229999999999999,"99937","Oklahoma",null,"OK","Latimer",null,null,"Stafford"]
["Le Flore, OK",0.77229999999999999,"99937","Oklahoma",null,"OK","Le Flore",null,null,"Stanton"]
["Lincoln, OK",0.89439999999999997,"36420","Oklahoma City, OK",null,"OK","Lincoln",null,null,"Stevens"]
["Logan, OK",0.89439999999999997,"36420","Oklahoma City, OK",null,"OK","Logan",null,null,"Sumner"]
["Love, OK",0.77229999999999999,"99937","Oklahoma",null,"OK","Love",null,null,"Trego"]
["Mcclain, OK",0.89439999999999997,"36420","Oklahoma City, OK",null,"OK","Mcclain",null,null,"Wabaunsee"]
["Mccurtain, OK",0.77229999999999999,"99937","Oklahoma",null,"OK","Mccurtain",null,null,"Wallace"]
["Mcintosh, OK",0.77229999999999999,"99937","Oklahoma",null,"OK","Mcintosh",null,null,"Wichita"]
["Major, OK",0.77229999999999999,"99937","Oklahoma",null,"OK","Major",null,null,"Wilson"]
["Marshall, OK",0.77229999999999999,"99937","Oklahoma",null,"OK","Marshall",null,null,"Woodson"]
["Mayes, OK",0.77229999999999999,"99937","Oklahoma",null,"OK","Mayes",null,null,"Wyandotte"]
["Murray, OK",0.77229999999999999,"99937","Oklahoma",null,"OK","Murray",null,"TN","Blount"]
["Muskogee, OK",0.77229999999999999,"99937","Oklahoma",null,"OK","Muskogee",null,null,"Clay"]
["Noble, OK",0.77229999999999999,"99937","Oklahoma",null,"OK","Noble",null,null,"Coffee"]
["Nowata, OK",0.77229999999999999,"99937","Oklahoma",null,"OK","Nowata",null,null,"De Kalb"]
["Okfuskee, OK",0.77229999999999999,"99937","Oklahoma",null,"OK","Okfuskee",null,null,"Fayette"]
["Oklahoma, OK",0.89439999999999997,"36420","Oklahoma City, OK",null,"OK","Oklahoma",null,null,"Franklin"]
["Okmulgee, OK",0.83650000000000002,"46140","Tulsa, OK",null,"OK","Okmulgee",null,null,"Greene"]
["Osage, OK",0.83650000000000002,"46140","Tulsa, OK",null,"OK","Osage",null,null,"Henry"]
["Ottawa, OK",0.77229999999999999,"99937","Oklahoma",null,"OK","Ottawa",null,null,"Houston"]
["Pawnee, OK",0.83650000000000002,"46140","Tulsa, OK",null,"OK","Pawnee",null,null,"Jackson"]
["Payne, OK",0.77229999999999999,"99937","Oklahoma",null,"OK","Payne",null,null,"Jefferson"]
["Pittsburg, OK",0.77229999999999999,"99937","Oklahoma",null,"OK","Pittsburg",null,null,"Lauderdale"]
["Pontotoc, OK",0.77229999999999999,"99937","Oklahoma",null,"OK","Pontotoc",null,null,"Lawrence"]
["Pottawatomie, OK",0.77229999999999999,"99937","Oklahoma",null,"OK","Pottawatomie",null,null,"Macon"]
["Pushmataha, OK",0.77229999999999999,"99937","Oklahoma",null,"OK","Pushmataha",null,null,"Madison"]
["Roger Mills, OK",0.77229999999999999,"99937","Oklahoma",null,"OK","Roger Mills",null,null,"Marion"]
["Rogers, OK",0.83650000000000002,"46140","Tulsa, OK",null,"OK","Rogers",null,null,"Marshall"]
["Seminole, OK",0.77229999999999999,"99937","Oklahoma",null,"OK","Seminole",null,null,"Monroe"]
["Sequoyah, OK",0.82750000000000001,"22900","Fort Smith, AR-OK",null,"OK","Sequoyah",null,null,"Montgomery"]
["Stephens, OK",0.77229999999999999,"99937","Oklahoma",null,"OK","Stephens",null,null,"Morgan"]
["Texas, OK",0.77229999999999999,"99937","Oklahoma",null,"OK","Texas",null,null,"Perry"]
["Tillman, OK",0.77229999999999999,"99937","Oklahoma",null,"OK","Tillman",null,null,"Shelby"]
["Tulsa, OK",0.83650000000000002,"46140","Tulsa, OK",null,"OK","Tulsa",null,null,"Washington"]
["Wagoner, OK",0.83650000000000002,"46140","Tulsa, OK",null,"OK","Wagoner",null,null,"Benton"]
["Washington, OK",0.77229999999999999,"99937","Oklahoma",null,"OK","Washington",null,null,"Bradley"]
["Washita, OK",0.77229999999999999,"99937","Oklahoma",null,"OK","Washita",null,null,"Carroll"]
["Woods, OK",0.77229999999999999,"99937","Oklahoma",null,"OK","Woods",null,null,"Johnson"]
["Woodward, OK",0.77229999999999999,"99937","Oklahoma",null,"OK","Woodward",null,null,"Lincoln"]
["Baker, OR",1.0690999999999999,"99938","Oregon",null,"OR","Baker",null,null,"Polk"]
["Benton, OR",1.0685,"18700","Corvallis, OR",null,"OR","Benton",null,null,"Scott"]
["Clackamas, OR",1.2202,"38900","Portland-Vancouver-Hillsboro, OR-WA",null,"OR","Clackamas",null,null,"Sevier"]
["Clatsop, OR",1.0690999999999999,"99938","Oregon",null,"OR","Clatsop",null,null,"Union"]
["Columbia, OR",1.2202,"38900","Portland-Vancouver-Hillsboro, OR-WA",null,"OR","Columbia",null,null,"Van Buren"]
["Coos, OR",1.0690999999999999,"99938","Oregon",null,"OR","Coos",null,null,"White"]
["Crook, OR",1.0690999999999999,"99938","Oregon",null,"OR","Crook",null,null,"Lake"]
["Curry, OR",1.0690999999999999,"99938","Oregon",null,"OR","Curry",null,null,"Hamilton"]
["Deschutes, OR",1.1449,"13460","Bend, OR",null,"OR","Deschutes",null,null,"Putnam"]
["Douglas, OR",1.0690999999999999,"99938","Oregon",null,"OR","Douglas",null,null,"Decatur"]
["Gilliam, OR",1.0690999999999999,"99938","Oregon",null,"OR","Gilliam",null,null,"Hancock"]
["Grant, OR",1.0690999999999999,"99938","Oregon",null,"OR","Grant",null,null,"Stewart"]
["Harney, OR",1.0690999999999999,"99938","Oregon",null,"OR","Harney",null,null,"Warren"]
["Hood River, OR",1.0690999999999999,"99938","Oregon",null,"OR","Hood River",null,null,"Wayne"]
["Jackson, OR",1.0828,"32780","Medford, OR",null,"OR","Jackson",null,null,"Lewis"]
["Jefferson, OR",1.0690999999999999,"99938","Oregon",null,"OR","Jefferson",null,null,"Cumberland"]
["Josephine, OR",1.0167999999999999,"24420","Grants Pass, OR",null,"OR","Josephine",null,null,"Grundy"]
["Klamath, OR",1.0690999999999999,"99938","Oregon",null,"OR","Klamath",null,null,"Hardin"]
["Lake, OR",1.0690999999999999,"99938","Oregon",null,"OR","Lake",null,null,"Henderson"]
["Lane, OR",1.1666000000000001,"21660","Eugene-Springfield, OR",null,"OR","Lane",null,null,"Knox"]
["Lincoln, OR",1.0690999999999999,"99938","Oregon",null,"OR","Lincoln",null,null,"Williamson"]
["Linn, OR",1.0690999999999999,"10540","Albany-Lebanon, OR",null,"OR","Linn",null,null,"Gibson"]
["Malheur, OR",1.0690999999999999,"99938","Oregon",null,"OR","Malheur",null,null,"Sullivan"]
["Marion, OR",1.1023000000000001,"41420","Salem, OR",null,"OR","Marion",null,null,"Tipton"]
["Morrow, OR",1.0690999999999999,"99938","Oregon",null,"OR","Morrow",null,null,"Anderson"]
["Multnomah, OR",1.2202,"38900","Portland-Vancouver-Hillsboro, OR-WA",null,"OR","Multnomah",null,null,"Smith"]
["Polk, OR",1.1023000000000001,"41420","Salem, OR",null,"OR","Polk",null,null,"Sumner"]
["Sherman, OR",1.0690999999999999,"99938","Oregon",null,"OR","Sherman",null,null,"Wilson"]
["Tillamook, OR",1.0690999999999999,"99938","Oregon",null,"OR","Tillamook",null,null,"Campbell"]
["Umatilla, OR",1.0690999999999999,"99938","Oregon",null,"OR","Umatilla",null,null,"Carter"]
["Union, OR",1.0690999999999999,"99938","Oregon",null,"OR","Union",null,null,"Hickman"]
["Wallowa, OR",1.0690999999999999,"99938","Oregon",null,"OR","Wallowa",null,null,"Robertson"]
["Wasco, OR",1.0690999999999999,"99938","Oregon",null,"OR","Wasco",null,null,"Claiborne"]
["Washington, OR",1.2202,"38900","Portland-Vancouver-Hillsboro, OR-WA",null,"OR","Washington",null,null,"Humphreys"]
["Wheeler, OR",1.0690999999999999,"99938","Oregon",null,"OR","Wheeler",null,null,"Davidson"]
["Yamhill, OR",1.2202,"38900","Portland-Vancouver-Hillsboro, OR-WA",null,"OR","Yamhill",null,null,"Haywood"]
["Adams, PA",1.0588,"23900","Gettysburg, PA",null,"PA","Adams",null,null,"Moore"]
["Allegheny, PA",0.84960000000000002,"38300","Pittsburgh, PA",null,"PA","Allegheny",null,null,"Rutherford"]
["Armstrong, PA",0.84960000000000002,"38300","Pittsburgh, PA",null,"PA","Armstrong",null,null,"Meigs"]
["Beaver, PA",0.84960000000000002,"38300","Pittsburgh, PA",null,"PA","Beaver",null,null,"Bedford"]
["Bedford, PA",0.80189999999999995,"99939","Pennsylvania",null,"PA","Bedford",null,null,"Chester"]
["Berks, PA",1.0065999999999999,"39740","Reading, PA",null,"PA","Berks",null,null,"Bledsoe"]
["Blair, PA",0.88790000000000002,"11020","Altoona, PA",null,"PA","Blair",null,null,"Cannon"]
["Bradford, PA",0.80189999999999995,"99939","Pennsylvania",null,"PA","Bradford",null,null,"Cheatham"]
["Bucks, PA",0.99139999999999995,"33874","Montgomery County-Bucks County-Chester County, PA",null,"PA","Bucks",null,null,"Cocke"]
["Butler, PA",0.84960000000000002,"38300","Pittsburgh, PA",null,"PA","Butler",null,null,"Crockett"]
["Cambria, PA",0.80959999999999999,"27780","Johnstown, PA",null,"PA","Cambria",null,null,"Dickson"]
["Cameron, PA",0.80189999999999995,"99939","Pennsylvania",null,"PA","Cameron",null,null,"Dyer"]
["Carbon, PA",0.95009999999999994,"10900","Allentown-Bethlehem-Easton, PA-NJ",null,"PA","Carbon",null,null,"Fentress"]
["Centre, PA",1.0710999999999999,"44300","State College, PA",null,"PA","Centre",null,null,"Giles"]
["Chester, PA",0.99139999999999995,"33874","Montgomery County-Bucks County-Chester County, PA",null,"PA","Chester",null,null,"Grainger"]
["Clarion, PA",0.80189999999999995,"99939","Pennsylvania",null,"PA","Clarion",null,null,"Hamblen"]
["Clearfield, PA",0.80189999999999995,"99939","Pennsylvania",null,"PA","Clearfield",null,null,"Hardeman"]
["Clinton, PA",0.80189999999999995,"99939","Pennsylvania",null,"PA","Clinton",null,null,"Hawkins"]
["Columbia, PA",0.85489999999999999,"14100","Bloomsburg-Berwick, PA",null,"PA","Columbia",null,null,"Loudon"]
["Crawford, PA",0.80189999999999995,"99939","Pennsylvania",null,"PA","Crawford",null,null,"Mc Minn"]
["Cumberland, PA",0.92290000000000005,"25420","Harrisburg-Carlisle, PA",null,"PA","Cumberland",null,null,"Mc Nairy"]
["Dauphin, PA",0.92290000000000005,"25420","Harrisburg-Carlisle, PA",null,"PA","Dauphin",null,null,"Maury"]
["Delaware, PA",1.0928,"37964","Philadelphia, PA",null,"PA","Delaware",null,null,"Obion"]
["Elk, PA",0.80189999999999995,"99939","Pennsylvania",null,"PA","Elk",null,null,"Overton"]
["Erie, PA",0.77339999999999998,"21500","Erie, PA",null,"PA","Erie",null,null,"Pickett"]
["Fayette, PA",0.84960000000000002,"38300","Pittsburgh, PA",null,"PA","Fayette",null,null,"Rhea"]
["Forest, PA",0.80189999999999995,"99939","Pennsylvania",null,"PA","Forest",null,null,"Roane"]
["Franklin, PA",1.1051,"16540","Chambersburg-Waynesboro, PA",null,"PA","Franklin",null,null,"Sequatchie"]
["Fulton, PA",0.80189999999999995,"99939","Pennsylvania",null,"PA","Fulton",null,null,"Trousdale"]
["Greene, PA",0.80189999999999995,"99939","Pennsylvania",null,"PA","Greene",null,null,"Unicoi"]
["Huntingdon, PA",0.80189999999999995,"99939","Pennsylvania",null,"PA","Huntingdon",null,null,"Weakley"]
["Indiana, PA",0.80189999999999995,"99939","Pennsylvania",null,"PA","Indiana",null,"TX","Calhoun"]
["Jefferson, PA",0.80189999999999995,"99939","Pennsylvania",null,"PA","Jefferson",null,null,"Chambers"]
["Juniata, PA",0.80189999999999995,"99939","Pennsylvania",null,"PA","Juniata",null,null,"Cherokee"]
["Lackawanna, PA",0.85309999999999997,"42540","Scranton--Wilkes-Barre, PA",null,"PA","Lackawanna",null,null,"Clay"]
["Lancaster, PA",0.91339999999999999,"29540","Lancaster, PA",null,"PA","Lancaster",null,null,"Dallas"]
["Lawrence, PA",0.80189999999999995,"99939","Pennsylvania",null,"PA","Lawrence",null,null,"Fayette"]
["Lebanon, PA",0.97970000000000002,"30140","Lebanon, PA",null,"PA","Lebanon",null,null,"Franklin"]
["Lehigh, PA",0.95009999999999994,"10900","Allentown-Bethlehem-Easton, PA-NJ",null,"PA","Lehigh",null,null,"Hale"]
["Luzerne, PA",0.85309999999999997,"42540","Scranton--Wilkes-Barre, PA",null,"PA","Luzerne",null,null,"Houston"]
["Lycoming, PA",0.90300000000000002,"48700","Williamsport, PA",null,"PA","Lycoming",null,null,"Jackson"]
["Mc Kean, PA",0.80189999999999995,"99939","Pennsylvania",null,"PA","Mc Kean",null,null,"Jefferson"]
["Mercer, PA",0.78879999999999995,"49660","Youngstown-Warren-Boardman, OH-PA",null,"PA","Mercer",null,null,"Lamar"]
["Mifflin, PA",0.80189999999999995,"99939","Pennsylvania",null,"PA","Mifflin",null,null,"Lee"]
["Monroe, PA",0.90490000000000004,"20700","East Stroudsburg, PA",null,"PA","Monroe",null,null,"Limestone"]
["Montgomery, PA",0.99139999999999995,"33874","Montgomery County-Bucks County-Chester County, PA",null,"PA","Montgomery",null,null,"Madison"]
["Montour, PA",0.85489999999999999,"14100","Bloomsburg-Berwick, PA",null,"PA","Montour",null,null,"Marion"]
["Northampton, PA",0.95009999999999994,"10900","Allentown-Bethlehem-Easton, PA-NJ",null,"PA","Northampton",null,null,"Montgomery"]
["Northumberlnd, PA",0.80189999999999995,"99939","Pennsylvania",null,"PA","Northumberlnd",null,null,"Shelby"]
["Perry, PA",0.92290000000000005,"25420","Harrisburg-Carlisle, PA",null,"PA","Perry",null,null,"Walker"]
["Philadelphia, PA",1.0928,"37964","Philadelphia, PA",null,"PA","Philadelphia",null,null,"Washington"]
["Pike, PA",1.1142000000000001,"35084","Newark, NJ-PA",null,"PA","Pike",null,null,"Howard"]
["Potter, PA",0.80189999999999995,"99939","Pennsylvania",null,"PA","Potter",null,null,"Johnson"]
["Schuylkill, PA",0.80189999999999995,"99939","Pennsylvania",null,"PA","Schuylkill",null,null,"Newton"]
["Snyder, PA",0.80189999999999995,"99939","Pennsylvania",null,"PA","Snyder",null,null,"Polk"]
["Somerset, PA",0.80189999999999995,"99939","Pennsylvania",null,"PA","Somerset",null,null,"Orange"]
["Sullivan, PA",0.80189999999999995,"99939","Pennsylvania",null,"PA","Sullivan",null,null,"Trinity"]
["Susquehanna, PA",0.80189999999999995,"99939","Pennsylvania",null,"PA","Susquehanna",null,null,"Delta"]
["Tioga, PA",0.80189999999999995,"99939","Pennsylvania",null,"PA","Tioga",null,null,"El Paso"]
["Union, PA",0.80189999999999995,"99939","Pennsylvania",null,"PA","Union",null,null,"Kent"]
["Venango, PA",0.80189999999999995,"99939","Pennsylvania",null,"PA","Venango",null,null,"Duval"]
["Warren, PA",0.80189999999999995,"99939","Pennsylvania",null,"PA","Warren",null,null,"Hamilton"]
["Washington, PA",0.84960000000000002,"38300","Pittsburgh, PA",null,"PA","Washington",null,null,"Leon"]
["Wayne, PA",0.80189999999999995,"99939","Pennsylvania",null,"PA","Wayne",null,null,"Liberty"]
["Westmoreland, PA",0.84960000000000002,"38300","Pittsburgh, PA",null,"PA","Westmoreland",null,null,"Martin"]
["Wyoming, PA",0.85309999999999997,"42540","Scranton--Wilkes-Barre, PA",null,"PA","Wyoming",null,null,"Taylor"]
["York, PA",0.94389999999999996,"49620","York-Hanover, PA",null,"PA","York",null,null,"Brooks"]
["Adjuntas, PR",0.38879999999999998,"38660","Ponce, PR",null,"PR","Adjuntas",null,null,"Dawson"]
["Aguada, PR",0.3241,"10380","Aguadilla-Isabela, PR",null,"PR","Aguada",null,null,"Fannin"]
["Aguadilla, PR",0.3241,"10380","Aguadilla-Isabela, PR",null,"PR","Aguadilla",null,null,"Floyd"]
["Aguas Buenas, PR",0.4047,"41980","San Juan-Bayam¢n-Caguas, PR",null,"PR","Aguas Buenas",null,null,"Hall"]
["Aibonito, PR",0.4047,"41980","San Juan-Bayam¢n-Caguas, PR",null,"PR","Aibonito",null,null,"Harris"]
["Anasco, PR",0.3241,"10380","Aguadilla-Isabela, PR",null,"PR","Anasco",null,null,"Jasper"]
["Arecibo, PR",0.35370000000000001,"11640","Arecibo, PR",null,"PR","Arecibo",null,null,"Jeff Davis"]
["Arroyo, PR",0.40489999999999998,"25020","Guayama, PR",null,"PR","Arroyo",null,null,"Jones"]
["Barceloneta, PR",0.4047,"41980","San Juan-Bayam¢n-Caguas, PR",null,"PR","Barceloneta",null,null,"Mitchell"]
["Barranquitas, PR",0.4047,"41980","San Juan-Bayam¢n-Caguas, PR",null,"PR","Barranquitas",null,null,"Stephens"]
["Bayamon, PR",0.4047,"41980","San Juan-Bayam¢n-Caguas, PR",null,"PR","Bayamon",null,null,"Terrell"]
["Cabo Rojo, PR",0.4385,"41900","San Germ n, PR",null,"PR","Cabo Rojo",null,null,"Wheeler"]
["Caguas, PR",0.4047,"41980","San Juan-Bayam¢n-Caguas, PR",null,"PR","Caguas",null,null,"Brown"]
["Camuy, PR",0.35370000000000001,"11640","Arecibo, PR",null,"PR","Camuy",null,null,"Cass"]
["Canovanas, PR",0.4047,"41980","San Juan-Bayam¢n-Caguas, PR",null,"PR","Canovanas",null,null,"De Witt"]
["Carolina, PR",0.4047,"41980","San Juan-Bayam¢n-Caguas, PR",null,"PR","Carolina",null,null,"Edwards"]
["Catano, PR",0.4047,"41980","San Juan-Bayam¢n-Caguas, PR",null,"PR","Catano",null,null,"Hardin"]
["Cayey, PR",0.4047,"41980","San Juan-Bayam¢n-Caguas, PR",null,"PR","Cayey",null,null,"Henderson"]
["Ceiba, PR",0.4047,"41980","San Juan-Bayam¢n-Caguas, PR",null,"PR","Ceiba",null,null,"Kendall"]
["Ciales, PR",0.4047,"41980","San Juan-Bayam¢n-Caguas, PR",null,"PR","Ciales",null,null,"Knox"]
["Cidra, PR",0.4047,"41980","San Juan-Bayam¢n-Caguas, PR",null,"PR","Cidra",null,null,"La Salle"]
["Coamo, PR",0.4047,"99940","Puerto Rico",null,"PR","Coamo",null,null,"Mason"]
["Comerio, PR",0.4047,"41980","San Juan-Bayam¢n-Caguas, PR",null,"PR","Comerio",null,null,"Menard"]
["Corozal, PR",0.4047,"41980","San Juan-Bayam¢n-Caguas, PR",null,"PR","Corozal",null,null,"Williamson"]
["Culebra, PR",0.4047,"99940","Puerto Rico",null,"PR","Culebra",null,null,"Harrison"]
["Dorado, PR",0.4047,"41980","San Juan-Bayam¢n-Caguas, PR",null,"PR","Dorado",null,null,"Mills"]
["Fajardo, PR",0.4047,"41980","San Juan-Bayam¢n-Caguas, PR",null,"PR","Fajardo",null,null,"Anderson"]
["Florida, PR",0.4047,"41980","San Juan-Bayam¢n-Caguas, PR",null,"PR","Florida",null,null,"Comanche"]
["Guanica, PR",0.36959999999999998,"49500","Yauco, PR",null,"PR","Guanica",null,null,"Ellis"]
["Guayama, PR",0.40489999999999998,"25020","Guayama, PR",null,"PR","Guayama",null,null,"Gray"]
["Guayanilla, PR",0.36959999999999998,"49500","Yauco, PR",null,"PR","Guayanilla",null,null,"Haskell"]
["Guaynabo, PR",0.4047,"41980","San Juan-Bayam¢n-Caguas, PR",null,"PR","Guaynabo",null,null,"Morris"]
["Gurabo, PR",0.4047,"41980","San Juan-Bayam¢n-Caguas, PR",null,"PR","Gurabo",null,null,"Sherman"]
["Hatillo, PR",0.35370000000000001,"11640","Arecibo, PR",null,"PR","Hatillo",null,null,"Smith"]
["Hormigueros, PR",0.34949999999999998,"32420","Mayag\u0081ez, PR",null,"PR","Hormigueros",null,null,"Wichita"]
["Humacao, PR",0.4047,"41980","San Juan-Bayam¢n-Caguas, PR",null,"PR","Humacao",null,null,"Wilson"]
["Isabela, PR",0.3241,"10380","Aguadilla-Isabela, PR",null,"PR","Isabela",null,null,"Bell"]
["Jayuya, PR",0.4047,"99940","Puerto Rico",null,"PR","Jayuya",null,null,"Caldwell"]
["Juana Diaz, PR",0.38879999999999998,"38660","Ponce, PR",null,"PR","Juana Diaz",null,null,"Grayson"]
["Juncos, PR",0.4047,"41980","San Juan-Bayam¢n-Caguas, PR",null,"PR","Juncos",null,null,"Hopkins"]
["Lajas, PR",0.4385,"41900","San Germ n, PR",null,"PR","Lajas",null,null,"Oldham"]
["Lares, PR",0.3241,"10380","Aguadilla-Isabela, PR",null,"PR","Lares",null,null,"Robertson"]
["Las Marias, PR",0.38450000000000001,"32420","Mayag\u0081ez, PR",null,"PR","Las Marias",null,null,"Cameron"]
["Las Piedras, PR",0.4047,"41980","San Juan-Bayam¢n-Caguas, PR",null,"PR","Las Piedras",null,null,"Red River"]
["Loiza, PR",0.4047,"41980","San Juan-Bayam¢n-Caguas, PR",null,"PR","Loiza",null,null,"Sabine"]
["Luquillo, PR",0.4047,"41980","San Juan-Bayam¢n-Caguas, PR",null,"PR","Luquillo",null,null,"Midland"]
["Manati, PR",0.4047,"41980","San Juan-Bayam¢n-Caguas, PR",null,"PR","Manati",null,null,"Panola"]
["Maricao, PR",0.4047,"99940","Puerto Rico",null,"PR","Maricao",null,null,"Hill"]
["Maunabo, PR",0.4047,"41980","San Juan-Bayam¢n-Caguas, PR",null,"PR","Maunabo",null,null,"Guadalupe"]
["Mayaguez, PR",0.34949999999999998,"32420","Mayag\u0081ez, PR",null,"PR","Mayaguez",null,null,"Hidalgo"]
["Moca, PR",0.3241,"10380","Aguadilla-Isabela, PR",null,"PR","Moca",null,null,"Moore"]
["Morovis, PR",0.4047,"41980","San Juan-Bayam¢n-Caguas, PR",null,"PR","Morovis",null,null,"Ward"]
["Maguabo, PR",0.4047,"41980","San Juan-Bayam¢n-Caguas, PR",null,"PR","Maguabo",null,null,"Medina"]
["Naranjito, PR",0.4047,"41980","San Juan-Bayam¢n-Caguas, PR",null,"PR","Naranjito",null,null,"Wood"]
["Orocovis, PR",0.4047,"41980","San Juan-Bayam¢n-Caguas, PR",null,"PR","Orocovis",null,null,"Armstrong"]
["Patillas, PR",0.40489999999999998,"25020","Guayama, PR",null,"PR","Patillas",null,null,"Potter"]
["Penuelas, PR",0.36959999999999998,"49500","Yauco, PR",null,"PR","Penuelas",null,null,"Hutchinson"]
["Ponce, PR",0.38879999999999998,"38660","Ponce, PR",null,"PR","Ponce",null,null,"Roberts"]
["Quebradillas, PR",0.35370000000000001,"11640","Arecibo, PR",null,"PR","Quebradillas",null,null,"Crockett"]
["Rincon, PR",0.3241,"10380","Aguadilla-Isabela, PR",null,"PR","Rincon",null,null,"Hardeman"]
["Rio Grande, PR",0.4047,"41980","San Juan-Bayam¢n-Caguas, PR",null,"PR","Rio Grande",null,null,"Andrews"]
["Sabana Grande, PR",0.4385,"41900","San Germ n, PR",null,"PR","Sabana Grande",null,null,"Angelina"]
["Salinas, PR",0.4047,"99940","Puerto Rico",null,"PR","Salinas",null,null,"Aransas"]
["San German, PR",0.4385,"41900","San Germ n, PR",null,"PR","San German",null,null,"Archer"]
["San Juan, PR",0.4047,"41980","San Juan-Bayam¢n-Caguas, PR",null,"PR","San Juan",null,null,"Atascosa"]
["San Lorenzo, PR",0.4047,"41980","San Juan-Bayam¢n-Caguas, PR",null,"PR","San Lorenzo",null,null,"Austin"]
["San Sebastian, PR",0.3241,"10380","Aguadilla-Isabela, PR",null,"PR","San Sebastian",null,null,"Bailey"]
["Santa Isabel, PR",0.4047,"99940","Puerto Rico",null,"PR","Santa Isabel",null,null,"Bandera"]
["Toa Alta, PR",0.4047,"41980","San Juan-Bayam¢n-Caguas, PR",null,"PR","Toa Alta",null,null,"Bastrop"]
["Toa Baja, PR",0.4047,"41980","San Juan-Bayam¢n-Caguas, PR",null,"PR","Toa Baja",null,null,"Baylor"]
["Trujillo Alto, PR",0.4047,"41980","San Juan-Bayam¢n-Caguas, PR",null,"PR","Trujillo Alto",null,null,"Bee"]
["Utuado, PR",0.3241,"10380","Aguadilla-Isabela, PR",null,"PR","Utuado",null,null,"Bexar"]
["Vega Alta, PR",0.4047,"41980","San Juan-Bayam¢n-Caguas, PR",null,"PR","Vega Alta",null,null,"Blanco"]
["Vega Baja, PR",0.4047,"41980","San Juan-Bayam¢n-Caguas, PR",null,"PR","Vega Baja",null,null,"Borden"]
["Vieques, PR",0.4047,"99940","Puerto Rico",null,"PR","Vieques",null,null,"Bosque"]
["Villalba, PR",0.38879999999999998,"38660","Ponce, PR",null,"PR","Villalba",null,null,"Bowie"]
["Yabucoa, PR",0.4047,"41980","San Juan-Bayam¢n-Caguas, PR",null,"PR","Yabucoa",null,null,"Brazoria"]
["Yauco, PR",0.36959999999999998,"49500","Yauco, PR",null,"PR","Yauco",null,null,"Brazos"]
["Bristol, RI",1.0189999999999999,"39300","Providence-Warwick, RI-MA",null,"RI","Bristol",null,null,"Brewster"]
["Kent, RI",1.0189999999999999,"39300","Providence-Warwick, RI-MA",null,"RI","Kent",null,null,"Briscoe"]
["Newport, RI",1.0189999999999999,"39300","Providence-Warwick, RI-MA",null,"RI","Newport",null,null,"Burleson"]
["Providence, RI",1.0189999999999999,"39300","Providence-Warwick, RI-MA",null,"RI","Providence",null,null,"Burnet"]
["Washington, RI",1.0189999999999999,"39300","Providence-Warwick, RI-MA",null,"RI","Washington",null,null,"Callahan"]
["Abbeville, SC",0.80649999999999999,"99942","South Carolina",null,"SC","Abbeville",null,null,"Camp"]
["Aiken, SC",0.86529999999999996,"12260","Augusta-Richmond County, GA-SC",null,"SC","Aiken",null,null,"Carson"]
["Allendale, SC",0.80649999999999999,"99942","South Carolina",null,"SC","Allendale",null,null,"Castro"]
["Anderson, SC",0.89859999999999995,"24860","Greenville-Anderson, SC",null,"SC","Anderson",null,null,"Childress"]
["Bamberg, SC",0.80649999999999999,"99942","South Carolina",null,"SC","Bamberg",null,null,"Cochran"]
["Barnwell, SC",0.80649999999999999,"99942","South Carolina",null,"SC","Barnwell",null,null,"Coke"]
["Beaufort, SC",0.80469999999999997,"25940","Hilton Head Island-Bluffton, SC",null,"SC","Beaufort",null,null,"Coleman"]
["Berkeley, SC",0.91410000000000002,"16700","Charleston-North Charleston, SC",null,"SC","Berkeley",null,null,"Collin"]
["Calhoun, SC",0.84560000000000002,"17900","Columbia, SC",null,"SC","Calhoun",null,null,"Collingsworth"]
["Charleston, SC",0.91410000000000002,"16700","Charleston-North Charleston, SC",null,"SC","Charleston",null,null,"Colorado"]
["Cherokee, SC",0.80649999999999999,"99942","South Carolina",null,"SC","Cherokee",null,null,"Comal"]
["Chester, SC",0.93369999999999997,"16740","Charlotte-Concord-Gastonia, NC-SC",null,"SC","Chester",null,null,"Concho"]
["Chesterfield, SC",0.80649999999999999,"99942","South Carolina",null,"SC","Chesterfield",null,null,"Cooke"]
["Clarendon, SC",0.78900000000000003,"44940","Sumter, SC",null,"SC","Clarendon",null,null,"Coryell"]
["Colleton, SC",0.80649999999999999,"99942","South Carolina",null,"SC","Colleton",null,null,"Cottle"]
["Darlington, SC",0.79520000000000002,"22500","Florence, SC",null,"SC","Darlington",null,null,"Crane"]
["Dillon, SC",0.80649999999999999,"99942","South Carolina",null,"SC","Dillon",null,null,"Crosby"]
["Dorchester, SC",0.91410000000000002,"16700","Charleston-North Charleston, SC",null,"SC","Dorchester",null,null,"Culberson"]
["Edgefield, SC",0.86529999999999996,"12260","Augusta-Richmond County, GA-SC",null,"SC","Edgefield",null,null,"Dallam"]
["Fairfield, SC",0.84560000000000002,"17900","Columbia, SC",null,"SC","Fairfield",null,null,"Deaf Smith"]
["Florence, SC",0.79520000000000002,"22500","Florence, SC",null,"SC","Florence",null,null,"Denton"]
["Georgetown, SC",0.80649999999999999,"99942","South Carolina",null,"SC","Georgetown",null,null,"Dickens"]
["Greenville, SC",0.89859999999999995,"24860","Greenville-Anderson, SC",null,"SC","Greenville",null,null,"Dimmit"]
["Greenwood, SC",0.80649999999999999,"99942","South Carolina",null,"SC","Greenwood",null,null,"Donley"]
["Hampton, SC",0.80649999999999999,"99942","South Carolina",null,"SC","Hampton",null,null,"Eastland"]
["Horry, SC",0.85350000000000004,"34820","Myrtle Beach-Conway-North Myrtle Beach, SC-NC",null,"SC","Horry",null,null,"Ector"]
["Jasper, SC",0.80469999999999997,"25940","Hilton Head Island-Bluffton, SC",null,"SC","Jasper",null,null,"Erath"]
["Kershaw, SC",0.84560000000000002,"17900","Columbia, SC",null,"SC","Kershaw",null,null,"Falls"]
["Lancaster, SC",0.93369999999999997,"16740","Charlotte-Concord-Gastonia, NC-SC",null,"SC","Lancaster",null,null,"Fisher"]
["Laurens, SC",0.89859999999999995,"24860","Greenville-Anderson, SC",null,"SC","Laurens",null,null,"Foard"]
["Lee, SC",0.80649999999999999,"99942","South Carolina",null,"SC","Lee",null,null,"Fort Bend"]
["Lexington, SC",0.84560000000000002,"17900","Columbia, SC",null,"SC","Lexington",null,null,"Freestone"]
["Mccormick, SC",0.80649999999999999,"99942","South Carolina",null,"SC","Mccormick",null,null,"Frio"]
["Marion, SC",0.80649999999999999,"99942","South Carolina",null,"SC","Marion",null,null,"Gaines"]
["Marlboro, SC",0.80649999999999999,"99942","South Carolina",null,"SC","Marlboro",null,null,"Galveston"]
["Newberry, SC",0.80649999999999999,"99942","South Carolina",null,"SC","Newberry",null,null,"Garza"]
["Oconee, SC",0.80649999999999999,"99942","South Carolina",null,"SC","Oconee",null,null,"Gillespie"]
["Orangeburg, SC",0.80649999999999999,"99942","South Carolina",null,"SC","Orangeburg",null,null,"Glasscock"]
["Pickens, SC",0.89859999999999995,"24860","Greenville-Anderson, SC",null,"SC","Pickens",null,null,"Goliad"]
["Richland, SC",0.84560000000000002,"17900","Columbia, SC",null,"SC","Richland",null,null,"Gonzales"]
["Saluda, SC",0.84560000000000002,"17900","Columbia, SC",null,"SC","Saluda",null,null,"Gregg"]
["Spartanburg, SC",0.86219999999999997,"43900","Spartanburg, SC",null,"SC","Spartanburg",null,null,"Grimes"]
["Sumter, SC",0.72829999999999995,"44940","Sumter, SC",null,"SC","Sumter",null,null,"Hansford"]
["Union, SC",0.81330000000000002,"99942","South Carolina",null,"SC","Union",null,null,"Hartley"]
["Williamsburg, SC",0.80649999999999999,"99942","South Carolina",null,"SC","Williamsburg",null,null,"Hays"]
["York, SC",0.93369999999999997,"16740","Charlotte-Concord-Gastonia, NC-SC",null,"SC","York",null,null,"Hemphill"]
["Aurora, SD",0.80300000000000005,"99943","South Dakota",null,"SD","Aurora",null,null,"Hockley"]
["Beadle, SD",0.80300000000000005,"99943","South Dakota",null,"SD","Beadle",null,null,"Hood"]
["Bennett, SD",0.80300000000000005,"99943","South Dakota",null,"SD","Bennett",null,null,"Hudspeth"]
["Bon Homme, SD",0.80300000000000005,"99943","South Dakota",null,"SD","Bon Homme",null,null,"Hunt"]
["Brookings, SD",0.80300000000000005,"99943","South Dakota",null,"SD","Brookings",null,null,"Irion"]
["Brown, SD",0.80300000000000005,"99943","South Dakota",null,"SD","Brown",null,null,"Jack"]
["Brule, SD",0.80300000000000005,"99943","South Dakota",null,"SD","Brule",null,null,"Jim Hogg"]
["Buffalo, SD",0.80300000000000005,"99943","South Dakota",null,"SD","Buffalo",null,null,"Jim Wells"]
["Butte, SD",0.80300000000000005,"99943","South Dakota",null,"SD","Butte",null,null,"Karnes"]
["Campbell, SD",0.80300000000000005,"99943","South Dakota",null,"SD","Campbell",null,null,"Kaufman"]
["Charles Mix, SD",0.80300000000000005,"99943","South Dakota",null,"SD","Charles Mix",null,null,"Kenedy"]
["Clark, SD",0.80300000000000005,"99943","South Dakota",null,"SD","Clark",null,null,"Kerr"]
["Clay, SD",0.80300000000000005,"99943","South Dakota",null,"SD","Clay",null,null,"Kimble"]
["Codington, SD",0.80300000000000005,"99943","South Dakota",null,"SD","Codington",null,null,"King"]
["Corson, SD",0.80300000000000005,"99943","South Dakota",null,"SD","Corson",null,null,"Kinney"]
["Custer, SD",0.82079999999999997,"99943","South Dakota",null,"SD","Custer",null,null,"Kleberg"]
["Davison, SD",0.80300000000000005,"99943","South Dakota",null,"SD","Davison",null,null,"Lamb"]
["Day, SD",0.80300000000000005,"99943","South Dakota",null,"SD","Day",null,null,"Lampasas"]
["Deuel, SD",0.80300000000000005,"99943","South Dakota",null,"SD","Deuel",null,null,"Lavaca"]
["Dewey, SD",0.80300000000000005,"99943","South Dakota",null,"SD","Dewey",null,null,"Lipscomb"]
["Douglas, SD",0.80300000000000005,"99943","South Dakota",null,"SD","Douglas",null,null,"Live Oak"]
["Edmunds, SD",0.80300000000000005,"99943","South Dakota",null,"SD","Edmunds",null,null,"Llano"]
["Fall River, SD",0.80300000000000005,"99943","South Dakota",null,"SD","Fall River",null,null,"Loving"]
["Faulk, SD",0.80300000000000005,"99943","South Dakota",null,"SD","Faulk",null,null,"Lubbock"]
["Grant, SD",0.80300000000000005,"99943","South Dakota",null,"SD","Grant",null,null,"Lynn"]
["Gregory, SD",0.80300000000000005,"99943","South Dakota",null,"SD","Gregory",null,null,"Mc Culloch"]
["Haakon, SD",0.80300000000000005,"99943","South Dakota",null,"SD","Haakon",null,null,"Mc Lennan"]
["Hamlin, SD",0.80300000000000005,"99943","South Dakota",null,"SD","Hamlin",null,null,"Mc Mullen"]
["Hand, SD",0.80300000000000005,"99943","South Dakota",null,"SD","Hand",null,null,"Matagorda"]
["Hanson, SD",0.80300000000000005,"99943","South Dakota",null,"SD","Hanson",null,null,"Maverick"]
["Harding, SD",0.80300000000000005,"99943","South Dakota",null,"SD","Harding",null,null,"Milam"]
["Hughes, SD",0.80300000000000005,"99943","South Dakota",null,"SD","Hughes",null,null,"Montague"]
["Hutchinson, SD",0.80300000000000005,"99943","South Dakota",null,"SD","Hutchinson",null,null,"Motley"]
["Hyde, SD",0.80300000000000005,"99943","South Dakota",null,"SD","Hyde",null,null,"Nacogdoches"]
["Jackson, SD",0.80300000000000005,"99943","South Dakota",null,"SD","Jackson",null,null,"Navarro"]
["Jerauld, SD",0.80300000000000005,"99943","South Dakota",null,"SD","Jerauld",null,null,"Nolan"]
["Jones, SD",0.80300000000000005,"99943","South Dakota",null,"SD","Jones",null,null,"Nueces"]
["Kingsbury, SD",0.80300000000000005,"99943","South Dakota",null,"SD","Kingsbury",null,null,"Ochiltree"]
["Lake, SD",0.80300000000000005,"99943","South Dakota",null,"SD","Lake",null,null,"Palo Pinto"]
["Lawrence, SD",0.80300000000000005,"99943","South Dakota",null,"SD","Lawrence",null,null,"Parker"]
["Lincoln, SD",0.80779999999999996,"43620","Sioux Falls, SD",null,"SD","Lincoln",null,null,"Parmer"]
["Lyman, SD",0.80300000000000005,"99943","South Dakota",null,"SD","Lyman",null,null,"Pecos"]
["Mc Cook, SD",0.80779999999999996,"43620","Sioux Falls, SD",null,"SD","Mc Cook",null,null,"Presidio"]
["Mc Pherson, SD",0.80300000000000005,"99943","South Dakota",null,"SD","Mc Pherson",null,null,"Rains"]
["Marshall, SD",0.80300000000000005,"99943","South Dakota",null,"SD","Marshall",null,null,"Randall"]
["Meade, SD",0.83320000000000005,"39660","Rapid City, SD",null,"SD","Meade",null,null,"Reagan"]
["Mellette, SD",0.80300000000000005,"99943","South Dakota",null,"SD","Mellette",null,null,"Real"]
["Miner, SD",0.80300000000000005,"99943","South Dakota",null,"SD","Miner",null,null,"Reeves"]
["Minnehaha, SD",0.80779999999999996,"43620","Sioux Falls, SD",null,"SD","Minnehaha",null,null,"Refugio"]
["Moody, SD",0.80300000000000005,"99943","South Dakota",null,"SD","Moody",null,null,"Rockwall"]
["Pennington, SD",0.83320000000000005,"39660","Rapid City, SD",null,"SD","Pennington",null,null,"Runnels"]
["Perkins, SD",0.80300000000000005,"99943","South Dakota",null,"SD","Perkins",null,null,"Rusk"]
["Potter, SD",0.80300000000000005,"99943","South Dakota",null,"SD","Potter",null,null,"San Augustine"]
["Roberts, SD",0.80300000000000005,"99943","South Dakota",null,"SD","Roberts",null,null,"San Jacinto"]
["Sanborn, SD",0.80300000000000005,"99943","South Dakota",null,"SD","Sanborn",null,null,"San Patricio"]
["Oglala Lakota, SD",0.80300000000000005,"99943","South Dakota",null,"SD","Oglala Lakota",null,null,"San Saba"]
["Spink, SD",0.80300000000000005,"99943","South Dakota",null,"SD","Spink",null,null,"Schleicher"]
["Stanley, SD",0.80300000000000005,"99943","South Dakota",null,"SD","Stanley",null,null,"Scurry"]
["Sully, SD",0.80300000000000005,"99943","South Dakota",null,"SD","Sully",null,null,"Shackelford"]
["Todd, SD",0.80300000000000005,"99943","South Dakota",null,"SD","Todd",null,null,"Somervell"]
["Tripp, SD",0.80300000000000005,"99943","South Dakota",null,"SD","Tripp",null,null,"Starr"]
["Turner, SD",0.80779999999999996,"43620","Sioux Falls, SD",null,"SD","Turner",null,null,"Sterling"]
["Union, SD",0.84399999999999997,"43580","Sioux City, IA-NE-SD",null,"SD","Union",null,null,"Stonewall"]
["Walworth, SD",0.80300000000000005,"99943","South Dakota",null,"SD","Walworth",null,null,"Sutton"]
["Yankton, SD",0.80300000000000005,"99943","South Dakota",null,"SD","Yankton",null,null,"Swisher"]
["Ziebach, SD",0.80300000000000005,"99943","South Dakota",null,"SD","Ziebach",null,null,"Tarrant"]
["Anderson, TN",0.71789999999999998,"28940","Knoxville, TN",null,"TN","Anderson",null,null,"Terry"]
["Bedford, TN",0.71460000000000001,"99944","Tennessee",null,"TN","Bedford",null,null,"Throckmorton"]
["Benton, TN",0.71460000000000001,"99944","Tennessee",null,"TN","Benton",null,null,"Titus"]
["Bledsoe, TN",0.71460000000000001,"99944","Tennessee",null,"TN","Bledsoe",null,null,"Tom Green"]
["Blount, TN",0.71789999999999998,"28940","Knoxville, TN",null,"TN","Blount",null,null,"Travis"]
["Bradley, TN",0.71550000000000002,"17420","Cleveland, TN",null,"TN","Bradley",null,null,"Tyler"]
["Campbell, TN",0.71789999999999998,"28940","Knoxville, TN",null,"TN","Campbell",null,null,"Upshur"]
["Cannon, TN",0.88339999999999996,"34980","Nashville-Davidson--Murfreesboro--Franklin, TN",null,"TN","Cannon",null,null,"Upton"]
["Carroll, TN",0.71460000000000001,"99944","Tennessee",null,"TN","Carroll",null,null,"Uvalde"]
["Carter, TN",0.72009999999999996,"27740","Johnson City, TN",null,"TN","Carter",null,null,"Val Verde"]
["Cheatham, TN",0.88339999999999996,"34980","Nashville-Davidson--Murfreesboro--Franklin, TN",null,"TN","Cheatham",null,null,"Van Zandt"]
["Chester, TN",0.75239999999999996,"27180","Jackson, TN",null,"TN","Chester",null,null,"Victoria"]
["Claiborne, TN",0.71460000000000001,"99944","Tennessee",null,"TN","Claiborne",null,null,"Waller"]
["Clay, TN",0.71460000000000001,"99944","Tennessee",null,"TN","Clay",null,null,"Webb"]
["Cocke, TN",0.71460000000000001,"99944","Tennessee",null,"TN","Cocke",null,null,"Wharton"]
["Coffee, TN",0.71460000000000001,"99944","Tennessee",null,"TN","Coffee",null,null,"Wilbarger"]
["Crockett, TN",0.75239999999999996,"27180","Jackson, TN",null,"TN","Crockett",null,null,"Willacy"]
["Cumberland, TN",0.71460000000000001,"99944","Tennessee",null,"TN","Cumberland",null,null,"Winkler"]
["Davidson, TN",0.88339999999999996,"34980","Nashville-Davidson--Murfreesboro--Franklin, TN",null,"TN","Davidson",null,null,"Wise"]
["Decatur, TN",0.71460000000000001,"99944","Tennessee",null,"TN","Decatur",null,null,"Yoakum"]
["De Kalb, TN",0.71460000000000001,"99944","Tennessee",null,"TN","De Kalb",null,null,"Young"]
["Dickson, TN",0.88339999999999996,"34980","Nashville-Davidson--Murfreesboro--Franklin, TN",null,"TN","Dickson",null,null,"Zapata"]
["Dyer, TN",0.71460000000000001,"99944","Tennessee",null,"TN","Dyer",null,null,"Zavala"]
["Fayette, TN",0.86699999999999999,"32820","Memphis, TN-MS-AR",null,"TN","Fayette",null,"ME","Franklin"]
["Fentress, TN",0.71460000000000001,"99944","Tennessee",null,"TN","Fentress",null,null,"Washington"]
["Franklin, TN",0.71460000000000001,"99944","Tennessee",null,"TN","Franklin",null,null,"Lincoln"]
["Gibson, TN",0.75239999999999996,"27180","Jackson, TN",null,"TN","Gibson",null,null,"Hancock"]
["Giles, TN",0.71460000000000001,"99944","Tennessee",null,"TN","Giles",null,null,"Cumberland"]
["Grainger, TN",0.69010000000000005,"34100","Morristown, TN",null,"TN","Grainger",null,null,"Knox"]
["Greene, TN",0.71460000000000001,"99944","Tennessee",null,"TN","Greene",null,null,"Androscoggin"]
["Grundy, TN",0.71460000000000001,"99944","Tennessee",null,"TN","Grundy",null,null,"Aroostook"]
["Hamblen, TN",0.69010000000000005,"34100","Morristown, TN",null,"TN","Hamblen",null,null,"Kennebec"]
["Hamilton, TN",0.83650000000000002,"16860","Chattanooga, TN-GA",null,"TN","Hamilton",null,null,"Oxford"]
["Hancock, TN",0.71460000000000001,"99944","Tennessee",null,"TN","Hancock",null,null,"Penobscot"]
["Hardeman, TN",0.71460000000000001,"99944","Tennessee",null,"TN","Hardeman",null,null,"Piscataquis"]
["Hardin, TN",0.71460000000000001,"99944","Tennessee",null,"TN","Hardin",null,null,"Sagadahoc"]
["Hawkins, TN",0.6996,"28700","Kingsport-Bristol, TN-VA",null,"TN","Hawkins",null,null,"Somerset"]
["Haywood, TN",0.71460000000000001,"99944","Tennessee",null,"TN","Haywood",null,null,"Waldo"]
["Henderson, TN",0.71460000000000001,"99944","Tennessee",null,"TN","Henderson",null,null,"York"]
["Henry, TN",0.71460000000000001,"99944","Tennessee",null,"TN","Henry",null,"AZ","Apache"]
["Hickman, TN",0.83989999999999998,"99944","Tennessee",null,"TN","Hickman",null,null,"Cochise"]
["Houston, TN",0.71460000000000001,"99944","Tennessee",null,"TN","Houston",null,null,"Coconino"]
["Humphreys, TN",0.71460000000000001,"99944","Tennessee",null,"TN","Humphreys",null,null,"Gila"]
["Jackson, TN",0.71460000000000001,"99944","Tennessee",null,"TN","Jackson",null,null,"Graham"]
["Jefferson, TN",0.69010000000000005,"34100","Morristown, TN",null,"TN","Jefferson",null,null,"Greenlee"]
["Johnson, TN",0.71460000000000001,"99944","Tennessee",null,"TN","Johnson",null,null,"Lapaz"]
["Knox, TN",0.71789999999999998,"28940","Knoxville, TN",null,"TN","Knox",null,null,"Maricopa"]
["Lake, TN",0.71460000000000001,"99944","Tennessee",null,"TN","Lake",null,null,"Mohave"]
["Lauderdale, TN",0.71460000000000001,"99944","Tennessee",null,"TN","Lauderdale",null,null,"Navajo"]
["Lawrence, TN",0.71460000000000001,"99944","Tennessee",null,"TN","Lawrence",null,null,"Pima"]
["Lewis, TN",0.71460000000000001,"99944","Tennessee",null,"TN","Lewis",null,null,"Pinal"]
["Lincoln, TN",0.71460000000000001,"99944","Tennessee",null,"TN","Lincoln",null,null,"Santa Cruz"]
["Loudon, TN",0.71789999999999998,"28940","Knoxville, TN",null,"TN","Loudon",null,null,"Yavapai"]
["Mc Minn, TN",0.71460000000000001,"99944","Tennessee",null,"TN","Mc Minn",null,null,"Yuma"]
["Mc Nairy, TN",0.71460000000000001,"99944","Tennessee",null,"TN","Mc Nairy",null,"GA","Baldwin"]
["Macon, TN",0.88339999999999996,"34980","Nashville-Davidson--Murfreesboro--Franklin, TN",null,"TN","Macon",null,null,"Bibb"]
["Madison, TN",0.75239999999999996,"27180","Jackson, TN",null,"TN","Madison",null,null,"Calhoun"]
["Marion, TN",0.83650000000000002,"16860","Chattanooga, TN-GA",null,"TN","Marion",null,null,"Cherokee"]
["Marshall, TN",0.71460000000000001,"99944","Tennessee",null,"TN","Marshall",null,null,"Clarke"]
["Maury, TN",0.88339999999999996,"34980","Nashville-Davidson--Murfreesboro--Franklin, TN",null,"TN","Maury",null,null,"Clay"]
["Meigs, TN",0.71460000000000001,"99944","Tennessee",null,"TN","Meigs",null,null,"Coffee"]
["Monroe, TN",0.71460000000000001,"99944","Tennessee",null,"TN","Monroe",null,null,"De Kalb"]
["Montgomery, TN",0.748,"17300","Clarksville, TN-KY",null,"TN","Montgomery",null,null,"Fayette"]
["Moore, TN",0.71460000000000001,"99944","Tennessee",null,"TN","Moore",null,null,"Franklin"]
["Morgan, TN",0.71789999999999998,"28940","Knoxville, TN",null,"TN","Morgan",null,null,"Greene"]
["Obion, TN",0.71460000000000001,"99944","Tennessee",null,"TN","Obion",null,null,"Henry"]
["Overton, TN",0.71460000000000001,"99944","Tennessee",null,"TN","Overton",null,null,"Houston"]
["Perry, TN",0.71460000000000001,"99944","Tennessee",null,"TN","Perry",null,null,"Jackson"]
["Pickett, TN",0.71460000000000001,"99944","Tennessee",null,"TN","Pickett",null,null,"Jefferson"]
["Polk, TN",0.71550000000000002,"17420","Cleveland, TN",null,"TN","Polk",null,null,"Lamar"]
["Putnam, TN",0.71460000000000001,"99944","Tennessee",null,"TN","Putnam",null,null,"Lee"]
["Rhea, TN",0.71460000000000001,"99944","Tennessee",null,"TN","Rhea",null,null,"Lowndes"]
["Roane, TN",0.71789999999999998,"28940","Knoxville, TN",null,"TN","Roane",null,null,"Macon"]
["Robertson, TN",0.88339999999999996,"34980","Nashville-Davidson--Murfreesboro--Franklin, TN",null,"TN","Robertson",null,null,"Madison"]
["Rutherford, TN",0.88339999999999996,"34980","Nashville-Davidson--Murfreesboro--Franklin, TN",null,"TN","Rutherford",null,null,"Marion"]
["Scott, TN",0.71460000000000001,"99944","Tennessee",null,"TN","Scott",null,null,"Monroe"]
["Sequatchie, TN",0.83650000000000002,"16860","Chattanooga, TN-GA",null,"TN","Sequatchie",null,null,"Montgomery"]
["Sevier, TN",0.71460000000000001,"99944","Tennessee",null,"TN","Sevier",null,null,"Morgan"]
["Shelby, TN",0.86699999999999999,"32820","Memphis, TN-MS-AR",null,"TN","Shelby",null,null,"Pickens"]
["Smith, TN",0.88339999999999996,"34980","Nashville-Davidson--Murfreesboro--Franklin, TN",null,"TN","Smith",null,null,"Pike"]
["Stewart, TN",0.748,"17300","Clarksville, TN-KY",null,"TN","Stewart",null,null,"Randolph"]
["Sullivan, TN",0.6996,"28700","Kingsport-Bristol, TN-VA",null,"TN","Sullivan",null,null,"Sumter"]
["Sumner, TN",0.88339999999999996,"34980","Nashville-Davidson--Murfreesboro--Franklin, TN",null,"TN","Sumner",null,null,"Walker"]
["Tipton, TN",0.86699999999999999,"32820","Memphis, TN-MS-AR",null,"TN","Tipton",null,null,"Washington"]
["Trousdale, TN",0.88339999999999996,"34980","Nashville-Davidson--Murfreesboro--Franklin, TN",null,"TN","Trousdale",null,null,"Wilcox"]
["Unicoi, TN",0.72009999999999996,"27740","Johnson City, TN",null,"TN","Unicoi",null,null,"Carroll"]
["Union, TN",0.71789999999999998,"28940","Knoxville, TN",null,"TN","Union",null,null,"Columbia"]
["Van Buren, TN",0.71460000000000001,"99944","Tennessee",null,"TN","Van Buren",null,null,"Crawford"]
["Warren, TN",0.71460000000000001,"99944","Tennessee",null,"TN","Warren",null,null,"Fulton"]
["Washington, TN",0.72009999999999996,"27740","Johnson City, TN",null,"TN","Washington",null,null,"Johnson"]
["Wayne, TN",0.71460000000000001,"99944","Tennessee",null,"TN","Wayne",null,null,"Lincoln"]
["Weakley, TN",0.71460000000000001,"99944","Tennessee",null,"TN","Weakley",null,null,"Miller"]
["White, TN",0.71460000000000001,"99944","Tennessee",null,"TN","White",null,null,"Newton"]
["Williamson, TN",0.88339999999999996,"34980","Nashville-Davidson--Murfreesboro--Franklin, TN",null,"TN","Williamson",null,null,"Polk"]
["Wilson, TN",0.88339999999999996,"34980","Nashville-Davidson--Murfreesboro--Franklin, TN",null,"TN","Wilson",null,null,"Pulaski"]
["Anderson, TX",0.82110000000000005,"99945","Texas",null,"TX","Anderson",null,null,"Union"]
["Andrews, TX",0.82110000000000005,"99945","Texas",null,"TX","Andrews",null,null,"White"]
["Angelina, TX",0.82110000000000005,"99945","Texas",null,"TX","Angelina",null,null,"Douglas"]
["Aransas, TX",0.88939999999999997,"99945","Texas",null,"TX","Aransas",null,null,"Elbert"]
["Archer, TX",0.92869999999999997,"48660","Wichita Falls, TX",null,"TX","Archer",null,null,"Baker"]
["Armstrong, TX",0.81310000000000004,"11100","Amarillo, TX",null,"TX","Armstrong",null,null,"Liberty"]
["Atascosa, TX",0.84960000000000002,"41700","San Antonio-New Braunfels, TX",null,"TX","Atascosa",null,null,"Putnam"]
["Austin, TX",1.0048999999999999,"26420","Houston-The Woodlands-Sugar Land, TX",null,"TX","Austin",null,null,"Seminole"]
["Bailey, TX",0.82110000000000005,"99945","Texas",null,"TX","Bailey",null,null,"Taylor"]
["Bandera, TX",0.84960000000000002,"41700","San Antonio-New Braunfels, TX",null,"TX","Bandera",null,null,"Walton"]
["Bastrop, TX",0.9476,"12420","Austin-Round Rock-Georgetown, TX",null,"TX","Bastrop",null,null,"Appling"]
["Baylor, TX",0.82110000000000005,"99945","Texas",null,"TX","Baylor",null,null,"Atkinson"]
["Bee, TX",0.82110000000000005,"99945","Texas",null,"TX","Bee",null,null,"Bacon"]
["Bell, TX",0.92200000000000004,"28660","Killeen-Temple, TX",null,"TX","Bell",null,null,"Banks"]
["Bexar, TX",0.84960000000000002,"41700","San Antonio-New Braunfels, TX",null,"TX","Bexar",null,null,"Barrow"]
["Blanco, TX",0.82110000000000005,"99945","Texas",null,"TX","Blanco",null,null,"Bartow"]
["Borden, TX",0.82110000000000005,"99945","Texas",null,"TX","Borden",null,null,"Ben Hill"]
["Bosque, TX",0.82110000000000005,"99945","Texas",null,"TX","Bosque",null,null,"Berrien"]
["Bowie, TX",0.85580000000000001,"45500","Texarkana, TX-AR",null,"TX","Bowie",null,null,"Bleckley"]
["Brazoria, TX",1.0048999999999999,"26420","Houston-The Woodlands-Sugar Land, TX",null,"TX","Brazoria",null,null,"Brantley"]
["Brazos, TX",0.86370000000000002,"17780","College Station-Bryan, TX",null,"TX","Brazos",null,null,"Brooks"]
["Brewster, TX",0.82110000000000005,"99945","Texas",null,"TX","Brewster",null,null,"Bryan"]
["Briscoe, TX",0.82110000000000005,"99945","Texas",null,"TX","Briscoe",null,null,"Bulloch"]
["Brooks, TX",0.82110000000000005,"99945","Texas",null,"TX","Brooks",null,null,"Burke"]
["Brown, TX",0.82110000000000005,"99945","Texas",null,"TX","Brown",null,null,"Butts"]
["Burleson, TX",0.86370000000000002,"17780","College Station-Bryan, TX",null,"TX","Burleson",null,null,"Camden"]
["Burnet, TX",0.82110000000000005,"99945","Texas",null,"TX","Burnet",null,null,"Candler"]
["Caldwell, TX",0.9476,"12420","Austin-Round Rock-Georgetown, TX",null,"TX","Caldwell",null,null,"Catoosa"]
["Calhoun, TX",0.82110000000000005,"99945","Texas",null,"TX","Calhoun",null,null,"Charlton"]
["Callahan, TX",0.8337,"10180","Abilene, TX",null,"TX","Callahan",null,null,"Chatham"]
["Cameron, TX",0.84709999999999996,"15180","Brownsville-Harlingen, TX",null,"TX","Cameron",null,null,"Chattahoochee"]
["Camp, TX",0.82110000000000005,"99945","Texas",null,"TX","Camp",null,null,"Chattooga"]
["Carson, TX",0.81310000000000004,"11100","Amarillo, TX",null,"TX","Carson",null,null,"Clayton"]
["Cass, TX",0.82110000000000005,"99945","Texas",null,"TX","Cass",null,null,"Clinch"]
["Castro, TX",0.82110000000000005,"99945","Texas",null,"TX","Castro",null,null,"Cobb"]
["Chambers, TX",1.0048999999999999,"26420","Houston-The Woodlands-Sugar Land, TX",null,"TX","Chambers",null,null,"Colquitt"]
["Cherokee, TX",0.82110000000000005,"99945","Texas",null,"TX","Cherokee",null,null,"Cook"]
["Childress, TX",0.82110000000000005,"99945","Texas",null,"TX","Childress",null,null,"Coweta"]
["Clay, TX",0.92869999999999997,"48660","Wichita Falls, TX",null,"TX","Clay",null,null,"Crisp"]
["Cochran, TX",0.82110000000000005,"99945","Texas",null,"TX","Cochran",null,null,"Dade"]
["Coke, TX",0.82110000000000005,"99945","Texas",null,"TX","Coke",null,null,"Dawson"]
["Coleman, TX",0.82110000000000005,"99945","Texas",null,"TX","Coleman",null,null,"Decatur"]
["Collin, TX",0.97440000000000004,"19124","Dallas-Plano-Irving, TX",null,"TX","Collin",null,null,"Dodge"]
["Collingsworth, TX",0.82110000000000005,"99945","Texas",null,"TX","Collingsworth",null,null,"Dooly"]
["Colorado, TX",0.82110000000000005,"99945","Texas",null,"TX","Colorado",null,null,"Dougherty"]
["Comal, TX",0.84960000000000002,"41700","San Antonio-New Braunfels, TX",null,"TX","Comal",null,null,"Early"]
["Comanche, TX",0.82110000000000005,"99945","Texas",null,"TX","Comanche",null,null,"Echols"]
["Concho, TX",0.82110000000000005,"99945","Texas",null,"TX","Concho",null,null,"Effingham"]
["Cooke, TX",0.82110000000000005,"99945","Texas",null,"TX","Cooke",null,null,"Emanuel"]
["Coryell, TX",0.92200000000000004,"28660","Killeen-Temple, TX",null,"TX","Coryell",null,null,"Evans"]
["Cottle, TX",0.82110000000000005,"99945","Texas",null,"TX","Cottle",null,null,"Fannin"]
["Crane, TX",0.82110000000000005,"99945","Texas",null,"TX","Crane",null,null,"Floyd"]
["Crockett, TX",0.82110000000000005,"99945","Texas",null,"TX","Crockett",null,null,"Forsyth"]
["Crosby, TX",0.85750000000000004,"31180","Lubbock, TX",null,"TX","Crosby",null,null,"Gilmer"]
["Culberson, TX",0.82110000000000005,"99945","Texas",null,"TX","Culberson",null,null,"Glascock"]
["Dallam, TX",0.82110000000000005,"99945","Texas",null,"TX","Dallam",null,null,"Glynn"]
["Dallas, TX",0.97440000000000004,"19124","Dallas-Plano-Irving, TX",null,"TX","Dallas",null,null,"Gordon"]
["Dawson, TX",0.82110000000000005,"99945","Texas",null,"TX","Dawson",null,null,"Grady"]
["Deaf Smith, TX",0.82110000000000005,"99945","Texas",null,"TX","Deaf Smith",null,null,"Gwinnett"]
["Delta, TX",0.82110000000000005,"99945","Texas",null,"TX","Delta",null,null,"Habersham"]
["Denton, TX",0.97440000000000004,"19124","Dallas-Plano-Irving, TX",null,"TX","Denton",null,null,"Hall"]
["De Witt, TX",0.82110000000000005,"99945","Texas",null,"TX","De Witt",null,null,"Hancock"]
["Dickens, TX",0.82110000000000005,"99945","Texas",null,"TX","Dickens",null,null,"Haralson"]
["Dimmit, TX",0.82110000000000005,"99945","Texas",null,"TX","Dimmit",null,null,"Harris"]
["Donley, TX",0.82110000000000005,"99945","Texas",null,"TX","Donley",null,null,"Hart"]
["Duval, TX",0.82110000000000005,"99945","Texas",null,"TX","Duval",null,null,"Heard"]
["Eastland, TX",0.82110000000000005,"99945","Texas",null,"TX","Eastland",null,null,"Irwin"]
["Ector, TX",0.87519999999999998,"36220","Odessa, TX",null,"TX","Ector",null,null,"Jasper"]
["Edwards, TX",0.82110000000000005,"99945","Texas",null,"TX","Edwards",null,null,"Jeff Davis"]
["Ellis, TX",0.97440000000000004,"19124","Dallas-Plano-Irving, TX",null,"TX","Ellis",null,null,"Jenkins"]
["El Paso, TX",0.79959999999999998,"21340","El Paso, TX",null,"TX","El Paso",null,null,"Jones"]
["Erath, TX",0.82110000000000005,"99945","Texas",null,"TX","Erath",null,null,"Lanier"]
["Falls, TX",0.92179999999999995,"47380","Waco, TX",null,"TX","Falls",null,null,"Laurens"]
["Fannin, TX",0.82110000000000005,"99945","Texas",null,"TX","Fannin",null,null,"Long"]
["Fayette, TX",0.82110000000000005,"99945","Texas",null,"TX","Fayette",null,null,"Lumpkin"]
["Fisher, TX",0.82110000000000005,"99945","Texas",null,"TX","Fisher",null,null,"Mc Duffie"]
["Floyd, TX",0.82110000000000005,"99945","Texas",null,"TX","Floyd",null,null,"Mc Intosh"]
["Foard, TX",0.82110000000000005,"99945","Texas",null,"TX","Foard",null,null,"Meriwether"]
["Fort Bend, TX",1.0048999999999999,"26420","Houston-The Woodlands-Sugar Land, TX",null,"TX","Fort Bend",null,null,"Mitchell"]
["Franklin, TX",0.82110000000000005,"99945","Texas",null,"TX","Franklin",null,null,"Murray"]
["Freestone, TX",0.82110000000000005,"99945","Texas",null,"TX","Freestone",null,null,"Muscogee"]
["Frio, TX",0.82110000000000005,"99945","Texas",null,"TX","Frio",null,null,"Oconee"]
["Gaines, TX",0.82110000000000005,"99945","Texas",null,"TX","Gaines",null,null,"Oglethorpe"]
["Galveston, TX",1.0048999999999999,"26420","Houston-The Woodlands-Sugar Land, TX",null,"TX","Galveston",null,null,"Paulding"]
["Garza, TX",0.82110000000000005,"99945","Texas",null,"TX","Garza",null,null,"Peach"]
["Gillespie, TX",0.82110000000000005,"99945","Texas",null,"TX","Gillespie",null,null,"Pierce"]
["Glasscock, TX",0.82110000000000005,"99945","Texas",null,"TX","Glasscock",null,null,"Quitman"]
["Goliad, TX",0.8891,"47020","Victoria, TX",null,"TX","Goliad",null,null,"Rabun"]
["Gonzales, TX",0.82110000000000005,"99945","Texas",null,"TX","Gonzales",null,null,"Richmond"]
["Gray, TX",0.82110000000000005,"99945","Texas",null,"TX","Gray",null,null,"Rockdale"]
["Grayson, TX",0.85240000000000005,"43300","Sherman-Denison, TX",null,"TX","Grayson",null,null,"Schley"]
["Gregg, TX",0.82920000000000005,"30980","Longview, TX",null,"TX","Gregg",null,null,"Screven"]
["Grimes, TX",0.82110000000000005,"99945","Texas",null,"TX","Grimes",null,null,"Spalding"]
["Guadalupe, TX",0.84960000000000002,"41700","San Antonio-New Braunfels, TX",null,"TX","Guadalupe",null,null,"Stephens"]
["Hale, TX",0.82110000000000005,"99945","Texas",null,"TX","Hale",null,null,"Stewart"]
["Hall, TX",0.82110000000000005,"99945","Texas",null,"TX","Hall",null,null,"Talbot"]
["Hamilton, TX",0.82110000000000005,"99945","Texas",null,"TX","Hamilton",null,null,"Taliaferro"]
["Hansford, TX",0.82110000000000005,"99945","Texas",null,"TX","Hansford",null,null,"Tattnall"]
["Hardeman, TX",0.82110000000000005,"99945","Texas",null,"TX","Hardeman",null,null,"Telfair"]
["Hardin, TX",0.86639999999999995,"13140","Beaumont-Port Arthur, TX",null,"TX","Hardin",null,null,"Terrell"]
["Harris, TX",1.0048999999999999,"26420","Houston-The Woodlands-Sugar Land, TX",null,"TX","Harris",null,null,"Thomas"]
["Harrison, TX",0.82920000000000005,"30980","Longview, TX",null,"TX","Harrison",null,null,"Tift"]
["Hartley, TX",0.82110000000000005,"99945","Texas",null,"TX","Hartley",null,null,"Toombs"]
["Haskell, TX",0.82110000000000005,"99945","Texas",null,"TX","Haskell",null,null,"Towns"]
["Hays, TX",0.9476,"12420","Austin-Round Rock-Georgetown, TX",null,"TX","Hays",null,null,"Treutlen"]
["Hemphill, TX",0.82110000000000005,"99945","Texas",null,"TX","Hemphill",null,null,"Troup"]
["Henderson, TX",0.82110000000000005,"99945","Texas",null,"TX","Henderson",null,null,"Turner"]
["Hidalgo, TX",0.80800000000000005,"32580","McAllen-Edinburg-Mission, TX",null,"TX","Hidalgo",null,null,"Twiggs"]
["Hill, TX",0.82110000000000005,"99945","Texas",null,"TX","Hill",null,null,"Upson"]
["Hockley, TX",0.82110000000000005,"99945","Texas",null,"TX","Hockley",null,null,"Ware"]
["Hood, TX",0.93020000000000003,"99945","Texas",null,"TX","Hood",null,null,"Warren"]
["Hopkins, TX",0.82110000000000005,"99945","Texas",null,"TX","Hopkins",null,null,"Wayne"]
["Houston, TX",0.82110000000000005,"99945","Texas",null,"TX","Houston",null,null,"Webster"]
["Howard, TX",0.82110000000000005,"99945","Texas",null,"TX","Howard",null,null,"Wheeler"]
["Hudspeth, TX",0.79959999999999998,"21340","El Paso, TX",null,"TX","Hudspeth",null,null,"Whitfield"]
["Hunt, TX",0.97440000000000004,"19124","Dallas-Plano-Irving, TX",null,"TX","Hunt",null,null,"Wilkes"]
["Hutchinson, TX",0.82110000000000005,"99945","Texas",null,"TX","Hutchinson",null,null,"Wilkinson"]
["Irion, TX",0.77780000000000005,"41660","San Angelo, TX",null,"TX","Irion",null,null,"Worth"]
["Jack, TX",0.82110000000000005,"99945","Texas",null,"TX","Jack",null,"AR","Calhoun"]
["Jackson, TX",0.82110000000000005,"99945","Texas",null,"TX","Jackson",null,null,"Clay"]
["Jasper, TX",0.82110000000000005,"99945","Texas",null,"TX","Jasper",null,null,"Cleburne"]
["Jeff Davis, TX",0.82110000000000005,"99945","Texas",null,"TX","Jeff Davis",null,null,"Dallas"]
["Jefferson, TX",0.86639999999999995,"13140","Beaumont-Port Arthur, TX",null,"TX","Jefferson",null,null,"Franklin"]
["Jim Hogg, TX",0.82110000000000005,"99945","Texas",null,"TX","Jim Hogg",null,null,"Greene"]
["Jim Wells, TX",0.82110000000000005,"99945","Texas",null,"TX","Jim Wells",null,null,"Jackson"]
["Johnson, TX",0.96970000000000001,"23104","Fort Worth-Arlington-Grapevine, TX",null,"TX","Johnson",null,null,"Jefferson"]
["Jones, TX",0.8337,"10180","Abilene, TX",null,"TX","Jones",null,null,"Lawrence"]
["Karnes, TX",0.82110000000000005,"99945","Texas",null,"TX","Karnes",null,null,"Lee"]
["Kaufman, TX",0.97440000000000004,"19124","Dallas-Plano-Irving, TX",null,"TX","Kaufman",null,null,"Madison"]
["Kendall, TX",0.84960000000000002,"41700","San Antonio-New Braunfels, TX",null,"TX","Kendall",null,null,"Marion"]
["Kenedy, TX",0.82110000000000005,"99945","Texas",null,"TX","Kenedy",null,null,"Monroe"]
["Kent, TX",0.82110000000000005,"99945","Texas",null,"TX","Kent",null,null,"Montgomery"]
["Kerr, TX",0.82110000000000005,"99945","Texas",null,"TX","Kerr",null,null,"Perry"]
["Kimble, TX",0.82110000000000005,"99945","Texas",null,"TX","Kimble",null,null,"Pike"]
["King, TX",0.82110000000000005,"99945","Texas",null,"TX","King",null,null,"Randolph"]
["Kinney, TX",0.82110000000000005,"99945","Texas",null,"TX","Kinney",null,null,"Washington"]
["Kleberg, TX",0.82110000000000005,"99945","Texas",null,"TX","Kleberg",null,null,"Arkansas"]
["Knox, TX",0.82110000000000005,"99945","Texas",null,"TX","Knox",null,null,"Ashley"]
["Lamar, TX",0.82110000000000005,"99945","Texas",null,"TX","Lamar",null,null,"Baxter"]
["Lamb, TX",0.82110000000000005,"99945","Texas",null,"TX","Lamb",null,null,"Benton"]
["Lampasas, TX",0.92200000000000004,"28660","Killeen-Temple, TX",null,"TX","Lampasas",null,null,"Boone"]
["La Salle, TX",0.82110000000000005,"99945","Texas",null,"TX","La Salle",null,null,"Bradley"]
["Lavaca, TX",0.82110000000000005,"99945","Texas",null,"TX","Lavaca",null,null,"Carroll"]
["Lee, TX",0.82110000000000005,"99945","Texas",null,"TX","Lee",null,null,"Chicot"]
["Leon, TX",0.82110000000000005,"99945","Texas",null,"TX","Leon",null,null,"Clark"]
["Liberty, TX",1.0048999999999999,"26420","Houston-The Woodlands-Sugar Land, TX",null,"TX","Liberty",null,null,"Cleveland"]
["Limestone, TX",0.82110000000000005,"99945","Texas",null,"TX","Limestone",null,null,"Columbia"]
["Lipscomb, TX",0.82110000000000005,"99945","Texas",null,"TX","Lipscomb",null,null,"Conway"]
["Live Oak, TX",0.82110000000000005,"99945","Texas",null,"TX","Live Oak",null,null,"Craighead"]
["Llano, TX",0.82110000000000005,"99945","Texas",null,"TX","Llano",null,null,"Crawford"]
["Loving, TX",0.82110000000000005,"99945","Texas",null,"TX","Loving",null,null,"Crittenden"]
["Lubbock, TX",0.85750000000000004,"31180","Lubbock, TX",null,"TX","Lubbock",null,null,"Cross"]
["Lynn, TX",0.85750000000000004,"31180","Lubbock, TX",null,"TX","Lynn",null,null,"Desha"]
["Mc Culloch, TX",0.82110000000000005,"99945","Texas",null,"TX","Mc Culloch",null,null,"Drew"]
["Mc Lennan, TX",0.92179999999999995,"47380","Waco, TX",null,"TX","Mc Lennan",null,null,"Faulkner"]
["Mc Mullen, TX",0.82110000000000005,"99945","Texas",null,"TX","Mc Mullen",null,null,"Fulton"]
["Madison, TX",0.82110000000000005,"99945","Texas",null,"TX","Madison",null,null,"Garland"]
["Marion, TX",0.82110000000000005,"99945","Texas",null,"TX","Marion",null,null,"Grant"]
["Martin, TX",0.94350000000000001,"33260","Midland, TX",null,"TX","Martin",null,null,"Hempstead"]
["Mason, TX",0.82110000000000005,"99945","Texas",null,"TX","Mason",null,null,"Hot Spring"]
["Matagorda, TX",0.82110000000000005,"99945","Texas",null,"TX","Matagorda",null,null,"Howard"]
["Maverick, TX",0.82110000000000005,"99945","Texas",null,"TX","Maverick",null,null,"Independence"]
["Medina, TX",0.84960000000000002,"41700","San Antonio-New Braunfels, TX",null,"TX","Medina",null,null,"Izard"]
["Menard, TX",0.82110000000000005,"99945","Texas",null,"TX","Menard",null,null,"Johnson"]
["Midland, TX",0.94350000000000001,"33260","Midland, TX",null,"TX","Midland",null,null,"Lafayette"]
["Milam, TX",0.82110000000000005,"99945","Texas",null,"TX","Milam",null,null,"Lincoln"]
["Mills, TX",0.82110000000000005,"99945","Texas",null,"TX","Mills",null,null,"Little River"]
["Mitchell, TX",0.82110000000000005,"99945","Texas",null,"TX","Mitchell",null,null,"Logan"]
["Montague, TX",0.82110000000000005,"99945","Texas",null,"TX","Montague",null,null,"Lonoke"]
["Montgomery, TX",1.0048999999999999,"26420","Houston-The Woodlands-Sugar Land, TX",null,"TX","Montgomery",null,null,"Miller"]
["Moore, TX",0.82110000000000005,"99945","Texas",null,"TX","Moore",null,null,"Mississippi"]
["Morris, TX",0.82110000000000005,"99945","Texas",null,"TX","Morris",null,null,"Nevada"]
["Motley, TX",0.82110000000000005,"99945","Texas",null,"TX","Motley",null,null,"Newton"]
["Nacogdoches, TX",0.82110000000000005,"99945","Texas",null,"TX","Nacogdoches",null,null,"Ouachita"]
["Navarro, TX",0.82110000000000005,"99945","Texas",null,"TX","Navarro",null,null,"Phillips"]
["Newton, TX",0.82110000000000005,"99945","Texas",null,"TX","Newton",null,null,"Poinsett"]
["Nolan, TX",0.82110000000000005,"99945","Texas",null,"TX","Nolan",null,null,"Polk"]
["Nueces, TX",0.95450000000000002,"18580","Corpus Christi, TX",null,"TX","Nueces",null,null,"Pope"]
["Ochiltree, TX",0.82110000000000005,"99945","Texas",null,"TX","Ochiltree",null,null,"Prairie"]
["Oldham, TX",0.81310000000000004,"11100","Amarillo, TX",null,"TX","Oldham",null,null,"Pulaski"]
["Orange, TX",0.86639999999999995,"13140","Beaumont-Port Arthur, TX",null,"TX","Orange",null,null,"St. Francis"]
["Palo Pinto, TX",0.82110000000000005,"99945","Texas",null,"TX","Palo Pinto",null,null,"Saline"]
["Panola, TX",0.82110000000000005,"99945","Texas",null,"TX","Panola",null,null,"Scott"]
["Parker, TX",0.96970000000000001,"23104","Fort Worth-Arlington-Grapevine, TX",null,"TX","Parker",null,null,"Searcy"]
["Parmer, TX",0.82110000000000005,"99945","Texas",null,"TX","Parmer",null,null,"Sebastian"]
["Pecos, TX",0.82110000000000005,"99945","Texas",null,"TX","Pecos",null,null,"Sevier"]
["Polk, TX",0.82110000000000005,"99945","Texas",null,"TX","Polk",null,null,"Sharp"]
["Potter, TX",0.81310000000000004,"11100","Amarillo, TX",null,"TX","Potter",null,null,"Stone"]
["Presidio, TX",0.82110000000000005,"99945","Texas",null,"TX","Presidio",null,null,"Union"]
["Rains, TX",0.82110000000000005,"99945","Texas",null,"TX","Rains",null,null,"Van Buren"]
["Randall, TX",0.81310000000000004,"11100","Amarillo, TX",null,"TX","Randall",null,null,"White"]
["Reagan, TX",0.82110000000000005,"99945","Texas",null,"TX","Reagan",null,null,"Woodruff"]
["Real, TX",0.82110000000000005,"99945","Texas",null,"TX","Real",null,null,"Yell"]
["Red River, TX",0.82110000000000005,"99945","Texas",null,"TX","Red River",null,"NJ","Union"]
["Reeves, TX",0.82110000000000005,"99945","Texas",null,"TX","Reeves",null,null,"Middlesex"]
["Refugio, TX",0.82110000000000005,"99945","Texas",null,"TX","Refugio",null,null,"Sussex"]
["Roberts, TX",0.82110000000000005,"99945","Texas",null,"TX","Roberts",null,null,"Camden"]
["Robertson, TX",0.86370000000000002,"17780","College Station-Bryan, TX",null,"TX","Robertson",null,null,"Warren"]
["Rockwall, TX",0.97440000000000004,"19124","Dallas-Plano-Irving, TX",null,"TX","Rockwall",null,null,"Cumberland"]
["Runnels, TX",0.82110000000000005,"99945","Texas",null,"TX","Runnels",null,null,"Mercer"]
["Rusk, TX",0.82920000000000005,"30980","Longview, TX",null,"TX","Rusk",null,null,"Morris"]
["Sabine, TX",0.82110000000000005,"99945","Texas",null,"TX","Sabine",null,null,"Somerset"]
["San Augustine, TX",0.82110000000000005,"99945","Texas",null,"TX","San Augustine",null,null,"Essex"]
["San Jacinto, TX",0.82110000000000005,"99945","Texas",null,"TX","San Jacinto",null,null,"Atlantic"]
["San Patricio, TX",0.95450000000000002,"18580","Corpus Christi, TX",null,"TX","San Patricio",null,null,"Bergen"]
["San Saba, TX",0.82110000000000005,"99945","Texas",null,"TX","San Saba",null,null,"Burlington"]
["Schleicher, TX",0.82110000000000005,"99945","Texas",null,"TX","Schleicher",null,null,"Cape May"]
["Scurry, TX",0.82110000000000005,"99945","Texas",null,"TX","Scurry",null,null,"Gloucester"]
["Shackelford, TX",0.82110000000000005,"99945","Texas",null,"TX","Shackelford",null,null,"Hudson"]
["Shelby, TX",0.82110000000000005,"99945","Texas",null,"TX","Shelby",null,null,"Hunterdon"]
["Sherman, TX",0.82110000000000005,"99945","Texas",null,"TX","Sherman",null,null,"Monmouth"]
["Smith, TX",0.8498,"46340","Tyler, TX",null,"TX","Smith",null,null,"Ocean"]
["Somervell, TX",0.93020000000000003,"99945","Texas",null,"TX","Somervell",null,null,"Passaic"]
["Starr, TX",0.82110000000000005,"99945","Texas",null,"TX","Starr",null,null,"Salem"]
["Stephens, TX",0.82110000000000005,"99945","Texas",null,"TX","Stephens",null,"SD","Clay"]
["Sterling, TX",0.77780000000000005,"41660","San Angelo, TX",null,"TX","Sterling",null,null,"Jackson"]
["Stonewall, TX",0.82110000000000005,"99945","Texas",null,"TX","Stonewall",null,null,"Lawrence"]
["Sutton, TX",0.82110000000000005,"99945","Texas",null,"TX","Sutton",null,null,"Marshall"]
["Swisher, TX",0.82110000000000005,"99945","Texas",null,"TX","Swisher",null,null,"Clark"]
["Tarrant, TX",0.96970000000000001,"23104","Fort Worth-Arlington-Grapevine, TX",null,"TX","Tarrant",null,null,"Grant"]
["Taylor, TX",0.8337,"10180","Abilene, TX",null,"TX","Taylor",null,null,"Lincoln"]
["Terrell, TX",0.82110000000000005,"99945","Texas",null,"TX","Terrell",null,null,"Union"]
["Terry, TX",0.82110000000000005,"99945","Texas",null,"TX","Terry",null,null,"Butte"]
["Throckmorton, TX",0.82110000000000005,"99945","Texas",null,"TX","Throckmorton",null,null,"Lake"]
["Titus, TX",0.82110000000000005,"99945","Texas",null,"TX","Titus",null,null,"Custer"]
["Tom Green, TX",0.77780000000000005,"41660","San Angelo, TX",null,"TX","Tom Green",null,null,"Douglas"]
["Travis, TX",0.9476,"12420","Austin-Round Rock-Georgetown, TX",null,"TX","Travis",null,null,"Jones"]
["Trinity, TX",0.82110000000000005,"99945","Texas",null,"TX","Trinity",null,null,"Turner"]
["Tyler, TX",0.82110000000000005,"99945","Texas",null,"TX","Tyler",null,null,"Brown"]
["Upshur, TX",0.82920000000000005,"30980","Longview, TX",null,"TX","Upshur",null,null,"Meade"]
["Upton, TX",0.82110000000000005,"99945","Texas",null,"TX","Upton",null,null,"Campbell"]
["Uvalde, TX",0.82110000000000005,"99945","Texas",null,"TX","Uvalde",null,null,"Todd"]
["Val Verde, TX",0.82110000000000005,"99945","Texas",null,"TX","Val Verde",null,null,"Pennington"]
["Van Zandt, TX",0.82110000000000005,"99945","Texas",null,"TX","Van Zandt",null,null,"Buffalo"]
["Victoria, TX",0.8891,"47020","Victoria, TX",null,"TX","Victoria",null,null,"Deuel"]
["Walker, TX",0.82110000000000005,"99945","Texas",null,"TX","Walker",null,null,"Mc Pherson"]
["Waller, TX",1.0048999999999999,"26420","Houston-The Woodlands-Sugar Land, TX",null,"TX","Waller",null,null,"Perkins"]
["Ward, TX",0.82110000000000005,"99945","Texas",null,"TX","Ward",null,null,"Harding"]
["Washington, TX",0.82110000000000005,"99945","Texas",null,"TX","Washington",null,null,"Hyde"]
["Webb, TX",0.7833,"29700","Laredo, TX",null,"TX","Webb",null,null,"Dewey"]
["Wharton, TX",0.82110000000000005,"99945","Texas",null,"TX","Wharton",null,null,"Hughes"]
["Wheeler, TX",0.82110000000000005,"99945","Texas",null,"TX","Wheeler",null,null,"Potter"]
["Wichita, TX",0.92869999999999997,"48660","Wichita Falls, TX",null,"TX","Wichita",null,null,"Aurora"]
["Wilbarger, TX",0.82110000000000005,"99945","Texas",null,"TX","Wilbarger",null,null,"Beadle"]
["Willacy, TX",0.82110000000000005,"99945","Texas",null,"TX","Willacy",null,null,"Bennett"]
["Williamson, TX",0.9476,"12420","Austin-Round Rock-Georgetown, TX",null,"TX","Williamson",null,null,"Bon Homme"]
["Wilson, TX",0.84960000000000002,"41700","San Antonio-New Braunfels, TX",null,"TX","Wilson",null,null,"Brookings"]
["Winkler, TX",0.82110000000000005,"99945","Texas",null,"TX","Winkler",null,null,"Brule"]
["Wise, TX",0.96970000000000001,"23104","Fort Worth-Arlington-Grapevine, TX",null,"TX","Wise",null,null,"Charles Mix"]
["Wood, TX",0.82110000000000005,"99945","Texas",null,"TX","Wood",null,null,"Codington"]
["Yoakum, TX",0.82110000000000005,"99945","Texas",null,"TX","Yoakum",null,null,"Corson"]
["Young, TX",0.82110000000000005,"99945","Texas",null,"TX","Young",null,null,"Davison"]
["Zapata, TX",0.82110000000000005,"99945","Texas",null,"TX","Zapata",null,null,"Day"]
["Zavala, TX",0.82110000000000005,"99945","Texas",null,"TX","Zavala",null,null,"Edmunds"]
["Beaver, UT",0.87139999999999995,"99946","Utah",null,"UT","Beaver",null,null,"Fall River"]
["Box Elder, UT",0.8962,"36260","Ogden-Clearfield, UT",null,"UT","Box Elder",null,null,"Faulk"]
["Cache, UT",0.90259999999999996,"30860","Logan, UT-ID",null,"UT","Cache",null,null,"Gregory"]
["Carbon, UT",0.87139999999999995,"99946","Utah",null,"UT","Carbon",null,null,"Haakon"]
["Daggett, UT",0.87139999999999995,"99946","Utah",null,"UT","Daggett",null,null,"Hamlin"]
["Davis, UT",0.8962,"36260","Ogden-Clearfield, UT",null,"UT","Davis",null,null,"Hand"]
["Duchesne, UT",0.87139999999999995,"99946","Utah",null,"UT","Duchesne",null,null,"Hanson"]
["Emery, UT",0.87139999999999995,"99946","Utah",null,"UT","Emery",null,null,"Hutchinson"]
["Garfield, UT",0.87139999999999995,"99946","Utah",null,"UT","Garfield",null,null,"Jerauld"]
["Grand, UT",0.87139999999999995,"99946","Utah",null,"UT","Grand",null,null,"Kingsbury"]
["Iron, UT",0.87139999999999995,"99946","Utah",null,"UT","Iron",null,null,"Lyman"]
["Juab, UT",0.93400000000000005,"39340","Provo-Orem, UT",null,"UT","Juab",null,null,"Mc Cook"]
["Kane, UT",0.87139999999999995,"99946","Utah",null,"UT","Kane",null,null,"Mellette"]
["Millard, UT",0.87139999999999995,"99946","Utah",null,"UT","Millard",null,null,"Miner"]
["Morgan, UT",0.8962,"36260","Ogden-Clearfield, UT",null,"UT","Morgan",null,null,"Minnehaha"]
["Piute, UT",0.87139999999999995,"99946","Utah",null,"UT","Piute",null,null,"Moody"]
["Rich, UT",0.87139999999999995,"99946","Utah",null,"UT","Rich",null,null,"Roberts"]
["Salt Lake, UT",0.9728,"41620","Salt Lake City, UT",null,"UT","Salt Lake",null,null,"Sanborn"]
["San Juan, UT",0.87139999999999995,"99946","Utah",null,"UT","San Juan",null,null,"Oglala Lakota"]
["Sanpete, UT",0.87139999999999995,"99946","Utah",null,"UT","Sanpete",null,null,"Spink"]
["Sevier, UT",0.87139999999999995,"99946","Utah",null,"UT","Sevier",null,null,"Stanley"]
["Summit, UT",0.87139999999999995,"99946","Utah",null,"UT","Summit",null,null,"Sully"]
["Tooele, UT",0.9728,"41620","Salt Lake City, UT",null,"UT","Tooele",null,null,"Tripp"]
["Uintah, UT",0.87139999999999995,"99946","Utah",null,"UT","Uintah",null,null,"Walworth"]
["Utah, UT",0.93400000000000005,"39340","Provo-Orem, UT",null,"UT","Utah",null,null,"Yankton"]
["Wasatch, UT",0.87139999999999995,"99946","Utah",null,"UT","Wasatch",null,null,"Ziebach"]
["Washington, UT",0.93510000000000004,"41100","St. George, UT",null,"UT","Washington",null,"AL","Autauga"]
["Wayne, UT",0.87139999999999995,"99946","Utah",null,"UT","Wayne",null,null,"Baldwin"]
["Weber, UT",0.8962,"36260","Ogden-Clearfield, UT",null,"UT","Weber",null,null,"Barbour"]
["Addison, VT",0.97130000000000005,"99947","Vermont",null,"VT","Addison",null,null,"Bibb"]
["Bennington, VT",0.97130000000000005,"99947","Vermont",null,"VT","Bennington",null,null,"Blount"]
["Caledonia, VT",0.97130000000000005,"99947","Vermont",null,"VT","Caledonia",null,null,"Bullock"]
["Chittenden, VT",1.0048999999999999,"15540","Burlington-South Burlington, VT",null,"VT","Chittenden",null,null,"Butler"]
["Essex, VT",0.97130000000000005,"99947","Vermont",null,"VT","Essex",null,null,"Calhoun"]
["Franklin, VT",1.0048999999999999,"15540","Burlington-South Burlington, VT",null,"VT","Franklin",null,null,"Chambers"]
["Grand Isle, VT",1.0048999999999999,"15540","Burlington-South Burlington, VT",null,"VT","Grand Isle",null,null,"Cherokee"]
["Lamoille, VT",0.97130000000000005,"99947","Vermont",null,"VT","Lamoille",null,null,"Chilton"]
["Orange, VT",0.97130000000000005,"99947","Vermont",null,"VT","Orange",null,null,"Choctaw"]
["Orleans, VT",0.97130000000000005,"99947","Vermont",null,"VT","Orleans",null,null,"Clarke"]
["Rutland, VT",0.97130000000000005,"99947","Vermont",null,"VT","Rutland",null,null,"Clay"]
["Washington, VT",0.97130000000000005,"99947","Vermont",null,"VT","Washington",null,null,"Cleburne"]
["Windham, VT",0.97130000000000005,"99947","Vermont",null,"VT","Windham",null,null,"Coffee"]
["Windsor, VT",0.97130000000000005,"99947","Vermont",null,"VT","Windsor",null,null,"Colbert"]
["Accomack, VA",0.77339999999999998,"99949","Virginia",null,"VA","Accomack",null,null,"Conecuh"]
["Albemarle, VA",0.9607,"16820","Charlottesville, VA",null,"VA","Albemarle",null,null,"Coosa"]
["Alexandria City, VA",1.0152000000000001,"47894","Washington-Arlington-Alexandria, DC-VA-MD-WV",null,"VA","Alexandria City",null,null,"Covington"]
["Alleghany, VA",0.77339999999999998,"99949","Virginia",null,"VA","Alleghany",null,null,"Crenshaw"]
["Amelia, VA",0.93899999999999995,"40060","Richmond, VA",null,"VA","Amelia",null,null,"Cullman"]
["Amherst, VA",0.85970000000000002,"31340","Lynchburg, VA",null,"VA","Amherst",null,null,"Dale"]
["Appomattox, VA",0.85970000000000002,"31340","Lynchburg, VA",null,"VA","Appomattox",null,null,"Dallas"]
["Arlington, VA",1.0152000000000001,"47894","Washington-Arlington-Alexandria, DC-VA-MD-WV",null,"VA","Arlington",null,null,"De Kalb"]
["Augusta, VA",0.94120000000000004,"44420","Staunton, VA",null,"VA","Augusta",null,null,"Elmore"]
["Bath, VA",0.77339999999999998,"99949","Virginia",null,"VA","Bath",null,null,"Escambia"]
["Bedford, VA",0.85970000000000002,"31340","Lynchburg, VA",null,"VA","Bedford",null,null,"Etowah"]
["Bland, VA",0.77339999999999998,"99949","Virginia",null,"VA","Bland",null,null,"Fayette"]
["Botetourt, VA",0.87609999999999999,"40220","Roanoke, VA",null,"VA","Botetourt",null,null,"Franklin"]
["Bristol City, VA",0.6996,"28700","Kingsport-Bristol, TN-VA",null,"VA","Bristol City",null,null,"Geneva"]
["Brunswick, VA",0.77339999999999998,"99949","Virginia",null,"VA","Brunswick",null,null,"Greene"]
["Buchanan, VA",0.77339999999999998,"99949","Virginia",null,"VA","Buchanan",null,null,"Hale"]
["Buckingham, VA",0.90269999999999995,"99949","Virginia",null,"VA","Buckingham",null,null,"Henry"]
["Buena Vista City, VA",0.77339999999999998,"99949","Virginia",null,"VA","Buena Vista City",null,null,"Houston"]
["Campbell, VA",0.85970000000000002,"31340","Lynchburg, VA",null,"VA","Campbell",null,null,"Jackson"]
["Caroline, VA",0.87670000000000003,"99949","Virginia",null,"VA","Caroline",null,null,"Jefferson"]
["Carroll, VA",0.77339999999999998,"99949","Virginia",null,"VA","Carroll",null,null,"Lamar"]
["Charles City, VA",0.93899999999999995,"40060","Richmond, VA",null,"VA","Charles City",null,null,"Lauderdale"]
["Charlotte, VA",0.77339999999999998,"99949","Virginia",null,"VA","Charlotte",null,null,"Lawrence"]
["Charlottesville City, VA",0.9607,"16820","Charlottesville, VA",null,"VA","Charlottesville City",null,null,"Lee"]
["Chesapeake City, VA",0.87960000000000005,"47260","Virginia Beach-Norfolk-Newport News, VA-NC",null,"VA","Chesapeake City",null,null,"Limestone"]
["Chesterfield, VA",0.93899999999999995,"40060","Richmond, VA",null,"VA","Chesterfield",null,null,"Lowndes"]
["Clarke, VA",1.0152000000000001,"47894","Washington-Arlington-Alexandria, DC-VA-MD-WV",null,"VA","Clarke",null,null,"Macon"]
["Colonial Heights City, VA",0.93899999999999995,"40060","Richmond, VA",null,"VA","Colonial Heights City",null,null,"Madison"]
["Covington City, VA",0.77339999999999998,"99949","Virginia",null,"VA","Covington City",null,null,"Marengo"]
["Craig, VA",0.87609999999999999,"40220","Roanoke, VA",null,"VA","Craig",null,null,"Marion"]
["Culpeper, VA",1.0152000000000001,"47894","Washington-Arlington-Alexandria, DC-VA-MD-WV",null,"VA","Culpeper",null,null,"Marshall"]
["Cumberland, VA",0.77339999999999998,"99949","Virginia",null,"VA","Cumberland",null,null,"Mobile"]
["Danville City, VA",0.77339999999999998,"99949","Virginia",null,"VA","Danville City",null,null,"Monroe"]
["Dickenson, VA",0.77339999999999998,"99949","Virginia",null,"VA","Dickenson",null,null,"Montgomery"]
["Dinwiddie, VA",0.93899999999999995,"40060","Richmond, VA",null,"VA","Dinwiddie",null,null,"Morgan"]
["Emporia City, VA",0.77339999999999998,"99949","Virginia",null,"VA","Emporia City",null,null,"Perry"]
["Essex, VA",0.77339999999999998,"99949","Virginia",null,"VA","Essex",null,null,"Pickens"]
["Fairfax City, VA",1.0152000000000001,"47894","Washington-Arlington-Alexandria, DC-VA-MD-WV",null,"VA","Fairfax City",null,null,"Pike"]
["Fairfax, VA",1.0152000000000001,"47894","Washington-Arlington-Alexandria, DC-VA-MD-WV",null,"VA","Fairfax",null,null,"Randolph"]
["Falls Church City, VA",1.0152000000000001,"47894","Washington-Arlington-Alexandria, DC-VA-MD-WV",null,"VA","Falls Church City",null,null,"Russell"]
["Fauquier, VA",1.0152000000000001,"47894","Washington-Arlington-Alexandria, DC-VA-MD-WV",null,"VA","Fauquier",null,null,"St. Clair"]
["Floyd, VA",0.8236,"99949","Virginia",null,"VA","Floyd",null,null,"Shelby"]
["Fluvanna, VA",0.9607,"16820","Charlottesville, VA",null,"VA","Fluvanna",null,null,"Sumter"]
["Franklin City, VA",0.87960000000000005,"47260","Virginia Beach-Norfolk-Newport News, VA-NC",null,"VA","Franklin City",null,null,"Talladega"]
["Franklin, VA",0.87609999999999999,"40220","Roanoke, VA",null,"VA","Franklin",null,null,"Tallapoosa"]
["Frederick, VA",0.89710000000000001,"49020","Winchester, VA-WV",null,"VA","Frederick",null,null,"Tuscaloosa"]
["Fredericksburg City, VA",1.0152000000000001,"47894","Washington-Arlington-Alexandria, DC-VA-MD-WV",null,"VA","Fredericksburg City",null,null,"Walker"]
["Galax City, VA",0.77339999999999998,"99949","Virginia",null,"VA","Galax City",null,null,"Washington"]
["Giles, VA",0.87649999999999995,"13980","Blacksburg-Christiansburg, VA",null,"VA","Giles",null,null,"Wilcox"]
["Gloucester, VA",0.87960000000000005,"47260","Virginia Beach-Norfolk-Newport News, VA-NC",null,"VA","Gloucester",null,null,"Winston"]
["Goochland, VA",0.93899999999999995,"40060","Richmond, VA",null,"VA","Goochland",null,"OR","Jackson"]
["Grayson, VA",0.77339999999999998,"99949","Virginia",null,"VA","Grayson",null,null,"Jefferson"]
["Greene, VA",0.9607,"16820","Charlottesville, VA",null,"VA","Greene",null,null,"Marion"]
["Greensville, VA",0.77339999999999998,"99949","Virginia",null,"VA","Greensville",null,null,"Washington"]
["Halifax, VA",0.77339999999999998,"99949","Virginia",null,"VA","Halifax",null,null,"Benton"]
["Hampton City, VA",0.87960000000000005,"47260","Virginia Beach-Norfolk-Newport News, VA-NC",null,"VA","Hampton City",null,null,"Columbia"]
["Hanover, VA",0.93899999999999995,"40060","Richmond, VA",null,"VA","Hanover",null,null,"Grant"]
["Harrisonburg City, VA",0.94210000000000005,"25500","Harrisonburg, VA",null,"VA","Harrisonburg City",null,null,"Lincoln"]
["Henrico, VA",0.93899999999999995,"40060","Richmond, VA",null,"VA","Henrico",null,null,"Polk"]
["Henry, VA",0.77339999999999998,"99949","Virginia",null,"VA","Henry",null,null,"Union"]
["Highland, VA",0.77339999999999998,"99949","Virginia",null,"VA","Highland",null,null,"Lake"]
["Hopewell City, VA",0.93899999999999995,"40060","Richmond, VA",null,"VA","Hopewell City",null,null,"Douglas"]
["Isle Of Wight, VA",0.87960000000000005,"47260","Virginia Beach-Norfolk-Newport News, VA-NC",null,"VA","Isle Of Wight",null,null,"Baker"]
["James City, VA",0.87960000000000005,"47260","Virginia Beach-Norfolk-Newport News, VA-NC",null,"VA","James City",null,null,"Wheeler"]
["King And Queen, VA",0.93899999999999995,"40060","Richmond, VA",null,"VA","King And Queen",null,null,"Linn"]
["King George, VA",0.77339999999999998,"99949","Virginia",null,"VA","King George",null,null,"Lane"]
["King William, VA",0.93899999999999995,"40060","Richmond, VA",null,"VA","King William",null,null,"Sherman"]
["Lancaster, VA",0.77339999999999998,"99949","Virginia",null,"VA","Lancaster",null,null,"Coos"]
["Lee, VA",0.77339999999999998,"99949","Virginia",null,"VA","Lee",null,null,"Curry"]
["Lexington City, VA",0.77339999999999998,"99949","Virginia",null,"VA","Lexington City",null,null,"Morrow"]
["Loudoun, VA",1.0152000000000001,"47894","Washington-Arlington-Alexandria, DC-VA-MD-WV",null,"VA","Loudoun",null,null,"Clackamas"]
["Louisa, VA",0.77339999999999998,"99949","Virginia",null,"VA","Louisa",null,null,"Clatsop"]
["Lunenburg, VA",0.77339999999999998,"99949","Virginia",null,"VA","Lunenburg",null,null,"Crook"]
["Lynchburg City, VA",0.85970000000000002,"31340","Lynchburg, VA",null,"VA","Lynchburg City",null,null,"Deschutes"]
["Madison, VA",1.0152000000000001,"47894","Washington-Arlington-Alexandria, DC-VA-MD-WV",null,"VA","Madison",null,null,"Gilliam"]
["Martinsville City, VA",0.77339999999999998,"99949","Virginia",null,"VA","Martinsville City",null,null,"Harney"]
["Manassas City, VA",1.0152000000000001,"47894","Washington-Arlington-Alexandria, DC-VA-MD-WV",null,"VA","Manassas City",null,null,"Hood River"]
["Manassas Park City, VA",1.0152000000000001,"47894","Washington-Arlington-Alexandria, DC-VA-MD-WV",null,"VA","Manassas Park City",null,null,"Josephine"]
["Mathews, VA",0.87960000000000005,"47260","Virginia Beach-Norfolk-Newport News, VA-NC",null,"VA","Mathews",null,null,"Klamath"]
["Mecklenburg, VA",0.77339999999999998,"99949","Virginia",null,"VA","Mecklenburg",null,null,"Malheur"]
["Middlesex, VA",0.77339999999999998,"99949","Virginia",null,"VA","Middlesex",null,null,"Multnomah"]
["Montgomery, VA",0.87649999999999995,"13980","Blacksburg-Christiansburg, VA",null,"VA","Montgomery",null,null,"Tillamook"]
["Nelson, VA",0.9607,"16820","Charlottesville, VA",null,"VA","Nelson",null,null,"Umatilla"]
["New Kent, VA",0.93899999999999995,"40060","Richmond, VA",null,"VA","New Kent",null,null,"Wallowa"]
["Newport News City, VA",0.87960000000000005,"47260","Virginia Beach-Norfolk-Newport News, VA-NC",null,"VA","Newport News City",null,null,"Wasco"]
["Norfolk City, VA",0.87960000000000005,"47260","Virginia Beach-Norfolk-Newport News, VA-NC",null,"VA","Norfolk City",null,null,"Yamhill"]
["Northampton, VA",0.77339999999999998,"99949","Virginia",null,"VA","Northampton",null,"WV","Barbour"]
["Northumberlnd, VA",0.77339999999999998,"99949","Virginia",null,"VA","Northumberlnd",null,null,"Calhoun"]
["Norton City, VA",0.77339999999999998,"99949","Virginia",null,"VA","Norton City",null,null,"Clay"]
["Nottoway, VA",0.77339999999999998,"99949","Virginia",null,"VA","Nottoway",null,null,"Fayette"]
["Orange, VA",0.77339999999999998,"99949","Virginia",null,"VA","Orange",null,null,"Jackson"]
["Page, VA",0.77339999999999998,"99949","Virginia",null,"VA","Page",null,null,"Jefferson"]
["Patrick, VA",0.77339999999999998,"99949","Virginia",null,"VA","Patrick",null,null,"Marion"]
["Petersburg City, VA",0.93899999999999995,"40060","Richmond, VA",null,"VA","Petersburg City",null,null,"Marshall"]
["Pittsylvania, VA",0.77339999999999998,"99949","Virginia",null,"VA","Pittsylvania",null,null,"Monroe"]
["Portsmouth City, VA",0.87960000000000005,"47260","Virginia Beach-Norfolk-Newport News, VA-NC",null,"VA","Portsmouth City",null,null,"Morgan"]
["Poquoson, VA",0.87960000000000005,"47260","Virginia Beach-Norfolk-Newport News, VA-NC",null,"VA","Poquoson",null,null,"Randolph"]
["Powhatan, VA",0.93899999999999995,"40060","Richmond, VA",null,"VA","Powhatan",null,null,"Boone"]
["Prince Edward, VA",0.77339999999999998,"99949","Virginia",null,"VA","Prince Edward",null,null,"Grant"]
["Prince George, VA",0.93899999999999995,"40060","Richmond, VA",null,"VA","Prince George",null,null,"Lincoln"]
["Prince William, VA",1.0152000000000001,"47894","Washington-Arlington-Alexandria, DC-VA-MD-WV",null,"VA","Prince William",null,null,"Logan"]
["Pulaski, VA",0.87649999999999995,"13980","Blacksburg-Christiansburg, VA",null,"VA","Pulaski",null,null,"Mineral"]
["Radford City, VA",0.87649999999999995,"13980","Blacksburg-Christiansburg, VA",null,"VA","Radford City",null,null,"Putnam"]
["Rappahannock, VA",1.0152000000000001,"47894","Washington-Arlington-Alexandria, DC-VA-MD-WV",null,"VA","Rappahannock",null,null,"Taylor"]
["Richmond, VA",0.77339999999999998,"99949","Virginia",null,"VA","Richmond",null,null,"Gilmer"]
["Richmond City, VA",0.93899999999999995,"40060","Richmond, VA",null,"VA","Richmond City",null,null,"Hancock"]
["Roanoke, VA",0.87609999999999999,"40220","Roanoke, VA",null,"VA","Roanoke",null,null,"Wayne"]
["Roanoke City, VA",0.87609999999999999,"40220","Roanoke, VA",null,"VA","Roanoke City",null,null,"Webster"]
["Rockbridge, VA",0.77339999999999998,"99949","Virginia",null,"VA","Rockbridge",null,null,"Lewis"]
["Rockingham, VA",0.94210000000000005,"25500","Harrisonburg, VA",null,"VA","Rockingham",null,null,"Mason"]
["Russell, VA",0.77339999999999998,"99949","Virginia",null,"VA","Russell",null,null,"Mercer"]
["Salem City, VA",0.87609999999999999,"40220","Roanoke, VA",null,"VA","Salem City",null,null,"Harrison"]
["Scott, VA",0.6996,"28700","Kingsport-Bristol, TN-VA",null,"VA","Scott",null,null,"Ohio"]
["Shenandoah, VA",0.77339999999999998,"99949","Virginia",null,"VA","Shenandoah",null,null,"Pocahontas"]
["Smyth, VA",0.77339999999999998,"99949","Virginia",null,"VA","Smyth",null,null,"Nicholas"]
["Southampton, VA",0.87960000000000005,"47260","Virginia Beach-Norfolk-Newport News, VA-NC",null,"VA","Southampton",null,null,"Pendleton"]
["Spotsylvania, VA",1.0152000000000001,"47894","Washington-Arlington-Alexandria, DC-VA-MD-WV",null,"VA","Spotsylvania",null,null,"Hampshire"]
["Stafford, VA",1.0152000000000001,"47894","Washington-Arlington-Alexandria, DC-VA-MD-WV",null,"VA","Stafford",null,null,"Wyoming"]
["Staunton City, VA",0.94120000000000004,"44420","Staunton, VA",null,"VA","Staunton City",null,null,"Mc Dowell"]
["Suffolk City, VA",0.87960000000000005,"47260","Virginia Beach-Norfolk-Newport News, VA-NC",null,"VA","Suffolk City",null,null,"Wood"]
["Surry, VA",0.77339999999999998,"99949","Virginia",null,"VA","Surry",null,null,"Berkeley"]
["Sussex, VA",0.93899999999999995,"40060","Richmond, VA",null,"VA","Sussex",null,null,"Roane"]
["Tazewell, VA",0.77339999999999998,"99949","Virginia",null,"VA","Tazewell",null,null,"Tyler"]
["Virginia Beach City, VA",0.87960000000000005,"47260","Virginia Beach-Norfolk-Newport News, VA-NC",null,"VA","Virginia Beach City",null,null,"Upshur"]
["Warren, VA",1.0152000000000001,"47894","Washington-Arlington-Alexandria, DC-VA-MD-WV",null,"VA","Warren",null,null,"Braxton"]
["Washington, VA",0.6996,"28700","Kingsport-Bristol, TN-VA",null,"VA","Washington",null,null,"Brooke"]
["Waynesboro City, VA",0.94120000000000004,"44420","Staunton, VA",null,"VA","Waynesboro City",null,null,"Cabell"]
["Westmoreland, VA",0.77339999999999998,"99949","Virginia",null,"VA","Westmoreland",null,null,"Doddridge"]
["Williamsburg City, VA",0.87960000000000005,"47260","Virginia Beach-Norfolk-Newport News, VA-NC",null,"VA","Williamsburg City",null,null,"Greenbrier"]
["Winchester City, VA",0.89710000000000001,"49020","Winchester, VA-WV",null,"VA","Winchester City",null,null,"Hardy"]
["Wise, VA",0.77339999999999998,"99949","Virginia",null,"VA","Wise",null,null,"Kanawha"]
["Wythe, VA",0.77339999999999998,"99949","Virginia",null,"VA","Wythe",null,null,"Mingo"]
["York, VA",0.87960000000000005,"47260","Virginia Beach-Norfolk-Newport News, VA-NC",null,"VA","York",null,null,"Monongalia"]
["Adams, WA",1.0291999999999999,"99950","Washington",null,"WA","Adams",null,null,"Pleasants"]
["Asotin, WA",0.81499999999999995,"30300","Lewiston, ID-WA",null,"WA","Asotin",null,null,"Preston"]
["Benton, WA",0.9819,"28420","Kennewick-Richland, WA",null,"WA","Benton",null,null,"Raleigh"]
["Chelan, WA",0.95940000000000003,"48300","Wenatchee, WA",null,"WA","Chelan",null,null,"Ritchie"]
["Clallam, WA",1.0291999999999999,"99950","Washington",null,"WA","Clallam",null,null,"Summers"]
["Clark, WA",1.2202,"38900","Portland-Vancouver-Hillsboro, OR-WA",null,"WA","Clark",null,null,"Tucker"]
["Columbia, WA",1.0291999999999999,"99950","Washington",null,"WA","Columbia",null,null,"Wetzel"]
["Cowlitz, WA",1.0509999999999999,"31020","Longview, WA",null,"WA","Cowlitz",null,null,"Wirt"]
["Douglas, WA",0.95940000000000003,"48300","Wenatchee, WA",null,"WA","Douglas",null,"MA","Franklin"]
["Ferry, WA",1.0291999999999999,"99950","Washington",null,"WA","Ferry",null,null,"Middlesex"]
["Franklin, WA",0.9819,"28420","Kennewick-Richland, WA",null,"WA","Franklin",null,null,"Plymouth"]
["Garfield, WA",1.0291999999999999,"99950","Washington",null,"WA","Garfield",null,null,"Worcester"]
["Grant, WA",1.0291999999999999,"99950","Washington",null,"WA","Grant",null,null,"Barnstable"]
["Grays Harbor, WA",1.0291999999999999,"99950","Washington",null,"WA","Grays Harbor",null,null,"Berkshire"]
["Island, WA",1.0291999999999999,"99950","Washington",null,"WA","Island",null,null,"Bristol"]
["Jefferson, WA",1.0291999999999999,"99950","Washington",null,"WA","Jefferson",null,null,"Dukes"]
["King, WA",1.1767000000000001,"42644","Seattle-Bellevue-Kent, WA",null,"WA","King",null,null,"Essex"]
["Kitsap, WA",1.1451,"14740","Bremerton-Silverdale-Port Orchard, WA",null,"WA","Kitsap",null,null,"Hampden"]
["Kittitas, WA",1.0291999999999999,"99950","Washington",null,"WA","Kittitas",null,null,"Hampshire"]
["Klickitat, WA",1.0291999999999999,"99950","Washington",null,"WA","Klickitat",null,null,"Nantucket"]
["Lewis, WA",1.0291999999999999,"99950","Washington",null,"WA","Lewis",null,null,"Norfolk"]
["Lincoln, WA",1.0291999999999999,"99950","Washington",null,"WA","Lincoln",null,null,"Suffolk"]
["Mason, WA",1.0291999999999999,"99950","Washington",null,"WA","Mason",null,"UT","Morgan"]
["Okanogan, WA",1.0291999999999999,"99950","Washington",null,"WA","Okanogan",null,null,"Washington"]
["Pacific, WA",1.0291999999999999,"99950","Washington",null,"WA","Pacific",null,null,"Sevier"]
["Pend Oreille, WA",1.0553999999999999,"99950","Washington",null,"WA","Pend Oreille",null,null,"Garfield"]
["Pierce, WA",1.1403000000000001,"45104","Tacoma-Lakewood, WA",null,"WA","Pierce",null,null,"Grand"]
["San Juan, WA",1.0291999999999999,"99950","Washington",null,"WA","San Juan",null,null,"San Juan"]
["Skagit, WA",1.0011000000000001,"34580","Mount Vernon-Anacortes, WA",null,"WA","Skagit",null,null,"Summit"]
["Skamania, WA",1.2202,"38900","Portland-Vancouver-Hillsboro, OR-WA",null,"WA","Skamania",null,null,"Wayne"]
["Snohomish, WA",1.1767000000000001,"42644","Seattle-Bellevue-Kent, WA",null,"WA","Snohomish",null,null,"Kane"]
["Spokane, WA",1.1045,"44060","Spokane-Spokane Valley, WA",null,"WA","Spokane",null,null,"Davis"]
["Stevens, WA",1.1045,"44060","Spokane-Spokane Valley, WA",null,"WA","Stevens",null,null,"Iron"]
["Thurston, WA",1.1363000000000001,"36500","Olympia-Lacey-Tumwater, WA",null,"WA","Thurston",null,null,"Carbon"]
["Wahkiakum, WA",1.0291999999999999,"99950","Washington",null,"WA","Wahkiakum",null,null,"Beaver"]
["Walla Walla, WA",1.0794999999999999,"47460","Walla Walla, WA",null,"WA","Walla Walla",null,null,"Box Elder"]
["Whatcom, WA",1.2149000000000001,"13380","Bellingham, WA",null,"WA","Whatcom",null,null,"Cache"]
["Whitman, WA",1.0291999999999999,"99950","Washington",null,"WA","Whitman",null,null,"Daggett"]
["Yakima, WA",0.94530000000000003,"49420","Yakima, WA",null,"WA","Yakima",null,null,"Duchesne"]
["Barbour, WV",0.73870000000000002,"99951","West Virginia",null,"WV","Barbour",null,null,"Emery"]
["Berkeley, WV",0.86180000000000001,"25180","Hagerstown-Martinsburg, MD-WV",null,"WV","Berkeley",null,null,"Juab"]
["Boone, WV",0.83299999999999996,"16620","Charleston, WV",null,"WV","Boone",null,null,"Millard"]
["Braxton, WV",0.73870000000000002,"99951","West Virginia",null,"WV","Braxton",null,null,"Piute"]
["Brooke, WV",0.79810000000000003,"48260","Weirton-Steubenville, WV-OH",null,"WV","Brooke",null,null,"Rich"]
["Cabell, WV",0.85050000000000003,"26580","Huntington-Ashland, WV-KY-OH",null,"WV","Cabell",null,null,"Salt Lake"]
["Calhoun, WV",0.73870000000000002,"99951","West Virginia",null,"WV","Calhoun",null,null,"Sanpete"]
["Clay, WV",0.83299999999999996,"16620","Charleston, WV",null,"WV","Clay",null,null,"Tooele"]
["Doddridge, WV",0.73870000000000002,"99951","West Virginia",null,"WV","Doddridge",null,null,"Uintah"]
["Fayette, WV",0.77229999999999999,"13220","Beckley, WV",null,"WV","Fayette",null,null,"Utah"]
["Gilmer, WV",0.73870000000000002,"99951","West Virginia",null,"WV","Gilmer",null,null,"Wasatch"]
["Grant, WV",0.73870000000000002,"99951","West Virginia",null,"WV","Grant",null,null,"Weber"]
["Greenbrier, WV",0.73870000000000002,"99951","West Virginia",null,"WV","Greenbrier",null,"MT","Jefferson"]
["Hampshire, WV",0.89710000000000001,"49020","Winchester, VA-WV",null,"WV","Hampshire",null,null,"Madison"]
["Hancock, WV",0.79810000000000003,"48260","Weirton-Steubenville, WV-OH",null,"WV","Hancock",null,null,"Lincoln"]
["Hardy, WV",0.73870000000000002,"99951","West Virginia",null,"WV","Hardy",null,null,"Phillips"]
["Harrison, WV",0.73870000000000002,"99951","West Virginia",null,"WV","Harrison",null,null,"Prairie"]
["Jackson, WV",0.83299999999999996,"16620","Charleston, WV",null,"WV","Jackson",null,null,"Lake"]
["Jefferson, WV",1.0152000000000001,"47894","Washington-Arlington-Alexandria, DC-VA-MD-WV",null,"WV","Jefferson",null,null,"Custer"]
["Kanawha, WV",0.83299999999999996,"16620","Charleston, WV",null,"WV","Kanawha",null,null,"Garfield"]
["Lewis, WV",0.73870000000000002,"99951","West Virginia",null,"WV","Lewis",null,null,"Mineral"]
["Lincoln, WV",0.83299999999999996,"16620","Charleston, WV",null,"WV","Lincoln",null,null,"Park"]
["Logan, WV",0.73870000000000002,"99951","West Virginia",null,"WV","Logan",null,null,"Liberty"]
["Mc Dowell, WV",0.73870000000000002,"99951","West Virginia",null,"WV","Mc Dowell",null,null,"Dawson"]
["Marion, WV",0.73870000000000002,"99951","West Virginia",null,"WV","Marion",null,null,"Blaine"]
["Marshall, WV",0.65980000000000005,"48540","Wheeling, WV-OH",null,"WV","Marshall",null,null,"Teton"]
["Mason, WV",0.73870000000000002,"99951","West Virginia",null,"WV","Mason",null,null,"Valley"]
["Mercer, WV",0.73870000000000002,"99951","West Virginia",null,"WV","Mercer",null,null,"Gallatin"]
["Mineral, WV",0.9002,"19060","Cumberland, MD-WV",null,"WV","Mineral",null,null,"Richland"]
["Mingo, WV",0.73870000000000002,"99951","West Virginia",null,"WV","Mingo",null,null,"Sheridan"]
["Monongalia, WV",0.81069999999999998,"34060","Morgantown, WV",null,"WV","Monongalia",null,null,"Carter"]
["Monroe, WV",0.73870000000000002,"99951","West Virginia",null,"WV","Monroe",null,null,"Powell"]
["Morgan, WV",0.84519999999999995,"25180","Hagerstown-Martinsburg, MD-WV",null,"WV","Morgan",null,null,"Beaverhead"]
["Nicholas, WV",0.73870000000000002,"99951","West Virginia",null,"WV","Nicholas",null,null,"Big Horn"]
["Ohio, WV",0.65980000000000005,"48540","Wheeling, WV-OH",null,"WV","Ohio",null,null,"Broadwater"]
["Pendleton, WV",0.73870000000000002,"99951","West Virginia",null,"WV","Pendleton",null,null,"Carbon"]
["Pleasants, WV",0.73870000000000002,"99951","West Virginia",null,"WV","Pleasants",null,null,"Cascade"]
["Pocahontas, WV",0.73870000000000002,"99951","West Virginia",null,"WV","Pocahontas",null,null,"Chouteau"]
["Preston, WV",0.81069999999999998,"34060","Morgantown, WV",null,"WV","Preston",null,null,"Daniels"]
["Putnam, WV",0.85050000000000003,"26580","Huntington-Ashland, WV-KY-OH",null,"WV","Putnam",null,null,"Deer Lodge"]
["Raleigh, WV",0.77229999999999999,"13220","Beckley, WV",null,"WV","Raleigh",null,null,"Fallon"]
["Randolph, WV",0.73870000000000002,"99951","West Virginia",null,"WV","Randolph",null,null,"Fergus"]
["Ritchie, WV",0.73870000000000002,"99951","West Virginia",null,"WV","Ritchie",null,null,"Flathead"]
["Roane, WV",0.73870000000000002,"99951","West Virginia",null,"WV","Roane",null,null,"Glacier"]
["Summers, WV",0.73870000000000002,"99951","West Virginia",null,"WV","Summers",null,null,"Golden Valley"]
["Taylor, WV",0.73870000000000002,"99951","West Virginia",null,"WV","Taylor",null,null,"Granite"]
["Tucker, WV",0.73870000000000002,"99951","West Virginia",null,"WV","Tucker",null,null,"Hill"]
["Tyler, WV",0.73870000000000002,"99951","West Virginia",null,"WV","Tyler",null,null,"Judith Basin"]
["Upshur, WV",0.73870000000000002,"99951","West Virginia",null,"WV","Upshur",null,null,"Lewis And Clark"]
["Wayne, WV",0.85050000000000003,"26580","Huntington-Ashland, WV-KY-OH",null,"WV","Wayne",null,null,"Mccone"]
["Webster, WV",0.73870000000000002,"99951","West Virginia",null,"WV","Webster",null,null,"Meagher"]
["Wetzel, WV",0.73870000000000002,"99951","West Virginia",null,"WV","Wetzel",null,null,"Missoula"]
["Wirt, WV",0.77710000000000001,"37620","Parkersburg-Vienna, WV",null,"WV","Wirt",null,null,"Musselshell"]
["Wood, WV",0.77710000000000001,"37620","Parkersburg-Vienna, WV",null,"WV","Wood",null,null,"Petroleum"]
["Wyoming, WV",0.73870000000000002,"99951","West Virginia",null,"WV","Wyoming",null,null,"Pondera"]
["Adams, WI",0.92179999999999995,"99952","Wisconsin",null,"WI","Adams",null,null,"Powder River"]
["Ashland, WI",0.92179999999999995,"99952","Wisconsin",null,"WI","Ashland",null,null,"Ravalli"]
["Barron, WI",0.92179999999999995,"99952","Wisconsin",null,"WI","Barron",null,null,"Roosevelt"]
["Bayfield, WI",0.92179999999999995,"99952","Wisconsin",null,"WI","Bayfield",null,null,"Rosebud"]
["Brown, WI",0.92820000000000003,"24580","Green Bay, WI",null,"WI","Brown",null,null,"Sanders"]
["Buffalo, WI",0.92179999999999995,"99952","Wisconsin",null,"WI","Buffalo",null,null,"Silver Bow"]
["Burnett, WI",0.92179999999999995,"99952","Wisconsin",null,"WI","Burnett",null,null,"Stillwater"]
["Calumet, WI",0.90300000000000002,"11540","Appleton, WI",null,"WI","Calumet",null,null,"Sweet Grass"]
["Chippewa, WI",0.96489999999999998,"20740","Eau Claire, WI",null,"WI","Chippewa",null,null,"Toole"]
["Clark, WI",0.92179999999999995,"99952","Wisconsin",null,"WI","Clark",null,null,"Treasure"]
["Columbia, WI",1.0274000000000001,"31540","Madison, WI",null,"WI","Columbia",null,null,"Wheatland"]
["Crawford, WI",0.92179999999999995,"99952","Wisconsin",null,"WI","Crawford",null,null,"Wibaux"]
["Dane, WI",1.0274000000000001,"31540","Madison, WI",null,"WI","Dane",null,null,"Yellowstone"]
["Dodge, WI",0.92179999999999995,"99952","Wisconsin",null,"WI","Dodge",null,"NH","Carroll"]
["Door, WI",0.92179999999999995,"99952","Wisconsin",null,"WI","Door",null,null,"Hillsborough"]
["Douglas, WI",0.97150000000000003,"20260","Duluth, MN-WI",null,"WI","Douglas",null,null,"Sullivan"]
["Dunn, WI",0.92179999999999995,"99952","Wisconsin",null,"WI","Dunn",null,null,"Belknap"]
["Eau Claire, WI",0.96489999999999998,"20740","Eau Claire, WI",null,"WI","Eau Claire",null,null,"Cheshire"]
["Florence, WI",0.92179999999999995,"99952","Wisconsin",null,"WI","Florence",null,null,"Coos"]
["Fond Du Lac, WI",0.89349999999999996,"22540","Fond du Lac, WI",null,"WI","Fond Du Lac",null,null,"Grafton"]
["Forest, WI",0.92179999999999995,"99952","Wisconsin",null,"WI","Forest",null,null,"Merrimack"]
["Grant, WI",0.92179999999999995,"99952","Wisconsin",null,"WI","Grant",null,null,"Rockingham"]
["Green, WI",1.0274000000000001,"31540","Madison, WI",null,"WI","Green",null,null,"Strafford"]
["Green Lake, WI",0.92179999999999995,"99952","Wisconsin",null,"WI","Green Lake",null,"NM","Grant"]
["Iowa, WI",1.0274000000000001,"31540","Madison, WI",null,"WI","Iowa",null,null,"Lincoln"]
["Iron, WI",0.92179999999999995,"99952","Wisconsin",null,"WI","Iron",null,null,"Union"]
["Jackson, WI",0.92179999999999995,"99952","Wisconsin",null,"WI","Jackson",null,null,"Sierra"]
["Jefferson, WI",0.92179999999999995,"99952","Wisconsin",null,"WI","Jefferson",null,null,"Otero"]
["Juneau, WI",0.92179999999999995,"99952","Wisconsin",null,"WI","Juneau",null,null,"San Juan"]
["Kenosha, WI",1.0192000000000001,"29404","Lake County-Kenosha County, IL-WI",null,"WI","Kenosha",null,null,"San Miguel"]
["Kewaunee, WI",0.92820000000000003,"24580","Green Bay, WI",null,"WI","Kewaunee",null,null,"Roosevelt"]
["La Crosse, WI",0.90920000000000001,"29100","La Crosse-Onalaska, WI-MN",null,"WI","La Crosse",null,null,"Colfax"]
["Lafayette, WI",0.92179999999999995,"99952","Wisconsin",null,"WI","Lafayette",null,null,"Bernalillo"]
["Langlade, WI",0.92179999999999995,"99952","Wisconsin",null,"WI","Langlade",null,null,"Catron"]
["Lincoln, WI",0.88070000000000004,"48140","Wausau-Weston, WI",null,"WI","Lincoln",null,null,"Chaves"]
["Manitowoc, WI",0.92179999999999995,"99952","Wisconsin",null,"WI","Manitowoc",null,null,"Cibola"]
["Marathon, WI",0.88070000000000004,"48140","Wausau-Weston, WI",null,"WI","Marathon",null,null,"Curry"]
["Marinette, WI",0.92179999999999995,"99952","Wisconsin",null,"WI","Marinette",null,null,"De Baca"]
["Marquette, WI",0.92179999999999995,"99952","Wisconsin",null,"WI","Marquette",null,null,"Dona Ana"]
["Menomonee, WI",0.92179999999999995,"99952","Wisconsin",null,"WI","Menomonee",null,null,"Eddy"]
["Milwaukee, WI",0.97719999999999996,"33340","Milwaukee-Waukesha, WI",null,"WI","Milwaukee",null,null,"Guadalupe"]
["Monroe, WI",0.92179999999999995,"99952","Wisconsin",null,"WI","Monroe",null,null,"Harding"]
["Oconto, WI",0.92820000000000003,"24580","Green Bay, WI",null,"WI","Oconto",null,null,"Hidalgo"]
["Oneida, WI",0.92179999999999995,"99952","Wisconsin",null,"WI","Oneida",null,null,"Lea"]
["Outagamie, WI",0.90300000000000002,"11540","Appleton, WI",null,"WI","Outagamie",null,null,"Los Alamos"]
["Ozaukee, WI",0.97719999999999996,"33340","Milwaukee-Waukesha, WI",null,"WI","Ozaukee",null,null,"Luna"]
["Pepin, WI",0.92179999999999995,"99952","Wisconsin",null,"WI","Pepin",null,null,"Mckinley"]
["Pierce, WI",1.1091,"33460","Minneapolis-St. Paul-Bloomington, MN-WI",null,"WI","Pierce",null,null,"Mora"]
["Polk, WI",0.92179999999999995,"99952","Wisconsin",null,"WI","Polk",null,null,"Quay"]
["Portage, WI",0.92179999999999995,"99952","Wisconsin",null,"WI","Portage",null,null,"Rio Arriba"]
["Price, WI",0.92179999999999995,"99952","Wisconsin",null,"WI","Price",null,null,"Sandoval"]
["Racine, WI",0.95630000000000004,"39540","Racine, WI",null,"WI","Racine",null,null,"Santa Fe"]
["Richland, WI",0.92179999999999995,"99952","Wisconsin",null,"WI","Richland",null,null,"Socorro"]
["Rock, WI",0.90129999999999999,"27500","Janesville-Beloit, WI",null,"WI","Rock",null,null,"Taos"]
["Rusk, WI",0.92179999999999995,"99952","Wisconsin",null,"WI","Rusk",null,null,"Torrance"]
["St. Croix, WI",1.1091,"33460","Minneapolis-St. Paul-Bloomington, MN-WI",null,"WI","St. Croix",null,null,"Valencia"]
["Sauk, WI",0.92179999999999995,"99952","Wisconsin",null,"WI","Sauk",null,"RI","Washington"]
["Sawyer, WI",0.92179999999999995,"99952","Wisconsin",null,"WI","Sawyer",null,null,"Kent"]
["Shawano, WI",0.92179999999999995,"99952","Wisconsin",null,"WI","Shawano",null,null,"Bristol"]
["Sheboygan, WI",0.94589999999999996,"43100","Sheboygan, WI",null,"WI","Sheboygan",null,null,"Newport"]
["Taylor, WI",0.92179999999999995,"99952","Wisconsin",null,"WI","Taylor",null,null,"Providence"]
["Trempealeau, WI",0.92179999999999995,"99952","Wisconsin",null,"WI","Trempealeau",null,"NV","Clark"]
["Vernon, WI",0.92179999999999995,"99952","Wisconsin",null,"WI","Vernon",null,null,"Lincoln"]
["Vilas, WI",0.92179999999999995,"99952","Wisconsin",null,"WI","Vilas",null,null,"Humboldt"]
["Walworth, WI",0.92179999999999995,"99952","Wisconsin",null,"WI","Walworth",null,null,"Douglas"]
["Washburn, WI",0.92179999999999995,"99952","Wisconsin",null,"WI","Washburn",null,null,"Mineral"]
["Washington, WI",0.97719999999999996,"33340","Milwaukee-Waukesha, WI",null,"WI","Washington",null,null,"Lyon"]
["Waukesha, WI",0.97719999999999996,"33340","Milwaukee-Waukesha, WI",null,"WI","Waukesha",null,null,"Churchill"]
["Waupaca, WI",0.92179999999999995,"99952","Wisconsin",null,"WI","Waupaca",null,null,"Elko"]
["Waushara, WI",0.92179999999999995,"99952","Wisconsin",null,"WI","Waushara",null,null,"Esmeralda"]
["Winnebago, WI",0.91849999999999998,"36780","Oshkosh-Neenah, WI",null,"WI","Winnebago",null,null,"Eureka"]
["Wood, WI",0.92179999999999995,"99952","Wisconsin",null,"WI","Wood",null,null,"Lander"]
["Albany, WY",0.94499999999999995,"99953","Wyoming",null,"WY","Albany",null,null,"Nye"]
["Big Horn, WY",0.94499999999999995,"99953","Wyoming",null,"WY","Big Horn",null,null,"Carson City"]
["Campbell, WY",0.94499999999999995,"99953","Wyoming",null,"WY","Campbell",null,null,"Pershing"]
["Carbon, WY",0.94499999999999995,"99953","Wyoming",null,"WY","Carbon",null,null,"Storey"]
["Converse, WY",0.94499999999999995,"99953","Wyoming",null,"WY","Converse",null,null,"Washoe"]
["Crook, WY",0.94499999999999995,"99953","Wyoming",null,"WY","Crook",null,null,"White Pine"]
["Fremont, WY",0.94499999999999995,"99953","Wyoming",null,"WY","Fremont",null,"DC","The District"]
["Goshen, WY",0.94499999999999995,"99953","Wyoming",null,"WY","Goshen",null,"CT","Fairfield"]
["Hot Springs, WY",0.94499999999999995,"99953","Wyoming",null,"WY","Hot Springs",null,null,"Hartford"]
["Johnson, WY",0.94499999999999995,"99953","Wyoming",null,"WY","Johnson",null,null,"Litchfield"]
["Laramie, WY",0.90739999999999998,"16940","Cheyenne, WY",null,"WY","Laramie",null,null,"Middlesex"]
["Lincoln, WY",0.94499999999999995,"99953","Wyoming",null,"WY","Lincoln",null,null,"New Haven"]
["Natrona, WY",0.9536,"16220","Casper, WY",null,"WY","Natrona",null,null,"New London"]
["Niobrara, WY",0.94499999999999995,"99953","Wyoming",null,"WY","Niobrara",null,null,"Tolland"]
["Park, WY",0.94499999999999995,"99953","Wyoming",null,"WY","Park",null,null,"Windham"]
["Platte, WY",0.94499999999999995,"99953","Wyoming",null,"WY","Platte",null,"HI","Kalawao"]
["Sheridan, WY",0.94499999999999995,"99953","Wyoming",null,"WY","Sheridan",null,null,"Hawaii"]
["Sublette, WY",0.94499999999999995,"99953","Wyoming",null,"WY","Sublette",null,null,"Honolulu"]
["Sweetwater, WY",0.94499999999999995,"99953","Wyoming",null,"WY","Sweetwater",null,null,"Kauai"]
["Teton, WY",0.94499999999999995,"99953","Wyoming",null,"WY","Teton",null,null,"Maui"]
["Uinta, WY",0.94499999999999995,"99953","Wyoming",null,"WY","Uinta",null,"DE","Kent"]
["Washakie, WY",0.94499999999999995,"99953","Wyoming",null,"WY","Washakie",null,null,"New Castle"]
["Weston, WY",0.94499999999999995,"99953","Wyoming",null,"WY","Weston",null,null,"Sussex"]

{"sheet":"Proof","index":20,"n_rows":18,"n_cols":18,"rows_kept":18,"cut":false,"hidden":true,"merged":[]}
[{"$f":"'FY 2021 SNF PDPM Rates'!D9","v":""}]
[]
[null,null,"Component","Component Group","Component Rate","VPD adjustment factor","VPD adjustment rate",null,"Labor portion","Wage index","Wage index adjusted rate","Non-labor portion","Total case mix and wage index adjustment rate","VPDA adjustment factor","VPD adjustment rate",null,"Calculator","Variance"]
[null,null,"PT","TN",{"$f":"IF($A$1=\"Urban\",VLOOKUP(D4,'Case-Mix_Rates'!B$1:E$17,3,FALSE),VLOOKUP(D4,'Case-Mix_Rates'!B$1:E$17,4,FALSE))","v":104.6656},1,{"$f":"E4*F4","v":104.6656},null,{"$f":"G4*Base_Rates!$B$7","v":74.626572799999991},{"$f":"$F$15","v":1},{"$f":"I4*J4","v":74.626572799999991},{"$f":"G4-I4","v":30.039027200000007},{"$f":"SUM(K4:L4)","v":104.6656},1,{"$f":"M4/N4","v":104.6656},null,{"$f":"VLOOKUP(D4,'FY 2021 SNF PDPM Rates'!$C$15:$D$30,2,FALSE)","v":104.6656},{"$f":"+Q4-O4","v":0}]
[null,null,"OT","TN",{"$f":"IF($A$1=\"Urban\",VLOOKUP(D5,'Case-Mix_Rates'!B$1:H$17,6,FALSE),VLOOKUP(D5,'Case-Mix_Rates'!B$1:H$17,7,FALSE))","v":97.425000000000011},1,{"$f":"E5*F5","v":97.425000000000011},null,{"$f":"G5*Base_Rates!$B$7","v":69.464025000000007},1,69.464025000000007,27.960975000000005,97.425000000000011,1,{"$f":"M5/N5","v":97.425000000000011},null,{"$f":"VLOOKUP(D5,'FY 2021 SNF PDPM Rates'!$C$15:$E$30,3,FALSE)","v":97.425000000000011},0]
[null,null,"SLP","SH",{"$f":"IF($A$1=\"Urban\",VLOOKUP(D6,'Case-Mix_Rates'!I$1:L$17,3,FALSE),VLOOKUP(D6,'Case-Mix_Rates'!I$1:L$17,4,FALSE))","v":83.454799999999992},null,{"$f":"E6","v":83.454799999999992},null,{"$f":"G6*Base_Rates!$B$7","v":59.503272399999993},1,59.503272399999993,23.951527599999999,83.454799999999992,null,{"$f":"M6","v":83.454799999999992},null,{"$f":"VLOOKUP(D6,'FY 2021 SNF PDPM Rates'!$H$15:$I$30,2,FALSE)","v":83.454799999999992},0]
[null,null,"Nursing","CBC2",{"$f":"IF($A$1=\"Urban\",VLOOKUP(D7,'Case-Mix_Rates'!M$1:P$26,3,FALSE),VLOOKUP(D7,'Case-Mix_Rates'!M$1:P$26,4,FALSE))","v":160.17700000000002},null,{"$f":"E7","v":160.17700000000002},null,{"$f":"G7*Base_Rates!$B$7","v":114.20620100000001},1,114.20620100000001,45.970799000000014,160.17700000000002,null,{"$f":"M7","v":160.17700000000002},null,{"$f":"VLOOKUP(D7,'FY 2021 SNF PDPM Rates'!$K$15:$L$30,2,FALSE)","v":160.17700000000002},0]
[null,null,"NTA","NC",{"$f":"IF($A$1=\"Urban\",VLOOKUP(D8,'Case-Mix_Rates'!Q$1:T$26,3,FALSE),VLOOKUP(D8,'Case-Mix_Rates'!Q$1:T$26,4,FALSE))","v":143.44639999999998},3,{"$f":"E8*F8","v":430.33919999999995},null,{"$f":"G8*Base_Rates!$B$7","v":306.83184959999994},1,306.83184959999994,123.50735040000001,430.33919999999995,3,{"$f":"M8/N8","v":143.44639999999998},null,{"$f":"VLOOKUP(D8,'FY 2021 SNF PDPM Rates'!$N$15:$O$30,2,FALSE)","v":143.44639999999998},0]
[null,null,"Non-Case-Mix",null,{"$f":"IF($A$1=\"Urban\",Base_Rates!$G$3,Base_Rates!$G$4)","v":98.64},null,{"$f":"E9","v":98.64},null,{"$f":"G9*Base_Rates!$B$7","v":70.33032},1,70.33032,28.30968,98.64,null,{"$f":"M9","v":98.64},null,{"$f":"VALUE('FY 2021 SNF PDPM Rates'!N28)","v":98.64},0]
[null,null,"Total PDPM Case_mix Adj. Per Diem",null,null,null,{"$f":"SUM(G4:G9)","v":974.70159999999998},null,{"$f":"SUM(I4:I9)","v":694.96224080000002},null,{"$f":"SUM(K4:K9)","v":694.96224080000002},{"$f":"SUM(L4:L9)","v":279.73935920000002},974.7016000000001,null,{"$f":"SUM(O4:O9)","v":687.80879999999991},null,{"$f":"SUM(Q4:Q9)","v":687.80879999999991},{"$f":"SUM(R4:R9)","v":0}]
[]
[null,null,"HIPPS code","PDPM case-mix-adjusted per diem","Labor portion","Wage index","Wage index adjusted rate","Non-labor portion","Total case mix and wage index adjustment rate"]
[null,null,"NHNC1",{"$f":"G10","v":974.70159999999998},{"$f":"D13*Base_Rates!$B$7","v":694.9622407999999},0.98340000000000005,{"$f":"E13*F13","v":683.4258676027199},{"$f":"D13-E13","v":279.73935920000008},{"$f":"SUM(G13:H13)","v":963.16522680271999},null,null,null,null,null,null,"NTA Adjustment",{"$f":"Q8*2","v":286.89279999999997}]
[null,null,null,null,null,null,null,null,null,null,null,null,null,null,null,"Calculator with Adjustment",{"$f":"+Q10+Q13","v":974.70159999999987}]
[null,null,"Calculator",{"$f":"G10","v":974.70159999999998},{"$f":"I10","v":694.96224080000002},{"$f":"VALUE('FY 2021 SNF PDPM Rates'!D11)","v":1},{"$f":"K10","v":694.96224080000002},{"$f":"L10","v":279.73935920000002},{"$f":"M10","v":974.7016000000001},null,null,null,null,null,null,"Wage index var",{"$f":"-G16","v":-11.536373197280113}]
[null,null,"Variance ($)",{"$f":"+D15-D13","v":0},0,1.6599999999999948E-2,11.536373197280113,0,11.536373197280113,null,null,null,null,null,null,"Adjusted total",{"$f":"SUM(Q14:Q15)","v":963.16522680271976}]
[null,null,"Variance (%)",{"$f":"+D16/D15","v":0},0,1.6599999999999948E-2,1.6600000000000163E-2,0,1.1835800000000115E-2,null,null,null,null,null,null,"Table 10 total",{"$f":"I13","v":963.16522680271999}]
[null,null,null,null,null,null,null,null,null,null,null,null,null,null,null,"Difference",{"$f":"+Q16-Q17","v":0}]

{"sheet":"Data - CBSA Designations","index":21,"n_rows":464,"n_cols":2,"rows_kept":464,"cut":false,"hidden":true,"merged":[]}
["CBSA Code","CBSA Designation"]
["10180","Abilene, TX"]
["10380","Aguadilla-Isabela, PR"]
["10420","Akron, OH"]
["10500","Albany, GA"]
["10540","Albany, OR"]
["10580","Albany-Schenectady-Troy, NY"]
["10740","Albuquerque, NM"]
["10780","Alexandria, LA"]
["10900","Allentown-Bethlehem-Easton, PA-NJ"]
["11020","Altoona, PA"]
["11100","Amarillo, TX"]
["11180","Ames, IA"]
["11244","Anaheim-Santa Ana-Irvine, CA"]
["11260","Anchorage, AK"]
["11460","Ann Arbor, MI"]
["11500","Anniston-Oxford-Jacksonville, AL"]
["11540","Appleton, WI"]
["11640","Arecibo, PR"]
["11700","Asheville, NC"]
["12020","Athens-Clarke County, GA"]
["12060","Atlanta-Sandy Springs-Roswell, GA"]
["12100","Atlantic City-Hammonton, NJ"]
["12220","Auburn-Opelika, AL"]
["12260","Augusta-Richmond County, GA-SC"]
["12420","Austin-Round Rock, TX"]
["12540","Bakersfield, CA"]
["12580","Baltimore-Columbia-Towson, MD"]
["12620","Bangor, ME"]
["12700","Barnstable Town, MA"]
["12940","Baton Rouge, LA"]
["12980","Battle Creek, MI"]
["13020","Bay City, MI"]
["13140","Beaumont-Port Arthur, TX"]
["13220","Beckley, WV"]
["13380","Bellingham, WA"]
["13460","Bend-Redmond, OR"]
["13740","Billings, MT"]
["13780","Binghamton, NY"]
["13820","Birmingham-Hoover, AL"]
["13900","Bismarck, ND"]
["13980","Blacksburg-Christiansburg-Radford, VA"]
["14010","Bloomington, IL"]
["14020","Bloomington, IN"]
["14100","Bloomsburg-Berwick, PA"]
["14260","Boise City, ID"]
["14454","Boston, MA"]
["14500","Boulder, CO"]
["14540","Bowling Green, KY"]
["14740","Bremerton-Silverdale, WA"]
["14860","Bridgeport-Stamford-Norwalk, CT"]
["15180","Brownsville-Harlingen, TX"]
["15260","Brunswick, GA"]
["15380","Buffalo-Cheektowaga-Niagara Falls, NY"]
["15500","Burlington, NC"]
["15540","Burlington-South Burlington, VT"]
["15680","California-Lexington Park, MD"]
["15764","Cambridge-Newton-Framingham, MA"]
["15804","Camden, NJ"]
["15940","Canton-Massillon, OH"]
["15980","Cape Coral-Fort Myers, FL"]
["16020","Cape Girardeau, MO-IL"]
["16060","Carbondale-Marion, IL"]
["16180","Carson City, NV"]
["16220","Casper, WY"]
["16300","Cedar Rapids, IA"]
["16540","Chambersburg-Waynesboro, PA"]
["16580","Champaign-Urbana, IL"]
["16620","Charleston, WV"]
["16700","Charleston-North Charleston, SC"]
["16740","Charlotte-Concord-Gastonia, NC-SC"]
["16820","Charlottesville, VA"]
["16860","Chattanooga, TN-GA"]
["16940","Cheyenne, WY"]
["16974","Chicago-Naperville-Arlington Heights, IL"]
["17020","Chico, CA"]
["17140","Cincinnati, OH-KY-IN"]
["17300","Clarksville, TN-KY"]
["17420","Cleveland, TN"]
["17460","Cleveland-Elyria, OH"]
["17660","Coeur d'Alene, ID"]
["17780","College Station-Bryan, TX"]
["17820","Colorado Springs, CO"]
["17860","Columbia, MO"]
["17900","Columbia, SC"]
["17980","Columbus, GA-AL"]
["18020","Columbus, IN"]
["18140","Columbus, OH"]
["18580","Corpus Christi, TX"]
["18700","Corvallis, OR"]
["18880","Crestview-Fort Walton Beach-Destin, FL"]
["19060","Cumberland, MD-WV"]
["19124","Dallas-Plano-Irving, TX"]
["19140","Dalton, GA"]
["19180","Danville, IL"]
["19300","Daphne-Fairhope-Foley, AL"]
["19340","Davenport-Moline-Rock Island, IA-IL"]
["19380","Dayton, OH"]
["19460","Decatur, AL"]
["19500","Decatur, IL"]
["19660","Deltona-Daytona Beach-Ormond Beach, FL"]
["19740","Denver-Aurora-Lakewood, CO"]
["19780","Des Moines-West Des Moines, IA"]
["19804","Detroit-Dearborn-Livonia, MI"]
["20020","Dothan, AL"]
["20100","Dover, DE"]
["20220","Dubuque, IA"]
["20260","Duluth, MN-WI"]
["20500","Durham-Chapel Hill, NC"]
["20524","Dutchess County-Putnam County, NY"]
["20700","East Stroudsburg, PA"]
["20740","Eau Claire, WI"]
["20940","El Centro, CA"]
["20994","Elgin, IL"]
["21060","Elizabethtown-Fort Knox, KY"]
["21140","Elkhart-Goshen, IN"]
["21300","Elmira, NY"]
["21340","El Paso, TX"]
["21420","Enid, OK"]
["21500","Erie, PA"]
["21660","Eugene, OR"]
["21780","Evansville, IN-KY"]
["21820","Fairbanks, AK"]
["22020","Fargo, ND-MN"]
["22140","Farmington, NM"]
["22180","Fayetteville, NC"]
["22220","Fayetteville-Springdale-Rogers, AR-MO"]
["22380","Flagstaff, AZ"]
["22420","Flint, MI"]
["22500","Florence, SC"]
["22520","Florence-Muscle Shoals, AL"]
["22540","Fond du Lac, WI"]
["22660","Fort Collins, CO"]
["22744","Fort Lauderdale-Pompano Beach-Deerfield Beach, FL"]
["22900","Fort Smith, AR-OK"]
["23060","Fort Wayne, IN"]
["23104","Fort Worth-Arlington, TX"]
["23420","Fresno, CA"]
["23460","Gadsden, AL"]
["23540","Gainesville, FL"]
["23580","Gainesville, GA"]
["23844","Gary, IN"]
["23900","Gettysburg, PA"]
["24020","Glens Falls, NY"]
["24140","Goldsboro, NC"]
["24220","Grand Forks, ND-MN"]
["24260","Grand Island, NE"]
["24300","Grand Junction, CO"]
["24340","Grand Rapids-Wyoming, MI"]
["24420","Grants Pass, OR"]
["24500","Great Falls, MT"]
["24540","Greeley, CO"]
["24580","Green Bay, WI"]
["24660","Greensboro-High Point, NC"]
["24780","Greenville, NC"]
["24860","Greenville-Anderson-Mauldin, SC"]
["25020","Guayama, PR"]
["25060","Gulfport-Biloxi-Pascagoula, MS"]
["25180","Hagerstown-Martinsburg, MD-WV"]
["25220","Hammond, LA"]
["25260","Hanford-Corcoran, CA"]
["25420","Harrisburg-Carlisle, PA"]
["25500","Harrisonburg, VA"]
["25540","Hartford-West Hartford-East Hartford, CT"]
["25620","Hattiesburg, MS"]
["25860","Hickory-Lenoir-Morganton, NC"]
["25940","Hilton Head Island-Bluffton-Beaufort, SC"]
["25980","Hinesville, GA"]
["26140","Homosassa Springs, FL"]
["26300","Hot Springs, AR"]
["26380","Houma-Thibodaux, LA"]
["26420","Houston-The Woodlands-Sugar Land, TX"]
["26580","Huntington-Ashland, WV-KY-OH"]
["26620","Huntsville, AL"]
["26820","Idaho Falls, ID"]
["26900","Indianapolis-Carmel-Anderson, IN"]
["26980","Iowa City, IA"]
["27060","Ithaca, NY"]
["27100","Jackson, MI"]
["27140","Jackson, MS"]
["27180","Jackson, TN"]
["27260","Jacksonville, FL"]
["27340","Jacksonville, NC"]
["27500","Janesville-Beloit, WI"]
["27620","Jefferson City, MO"]
["27740","Johnson City, TN"]
["27780","Johnstown, PA"]
["27860","Jonesboro, AR"]
["27900","Joplin, MO"]
["27980","Kahului-Wailuku-Lahaina, HI"]
["28020","Kalamazoo-Portage, MI"]
["28100","Kankakee, IL"]
["28140","Kansas City, MO-KS"]
["28420","Kennewick-Richland, WA"]
["28660","Killeen-Temple, TX"]
["28700","Kingsport-Bristol-Bristol, TN-VA"]
["28740","Kingston, NY"]
["28940","Knoxville, TN"]
["29020","Kokomo, IN"]
["29100","La Crosse-Onalaska, WI-MN"]
["29180","Lafayette, LA"]
["29200","Lafayette-West Lafayette, IN"]
["29340","Lake Charles, LA"]
["29404","Lake County-Kenosha County, IL-WI"]
["29420","Lake Havasu City-Kingman, AZ"]
["29460","Lakeland-Winter Haven, FL"]
["29540","Lancaster, PA"]
["29620","Lansing-East Lansing, MI"]
["29700","Laredo, TX"]
["29740","Las Cruces, NM"]
["29820","Las Vegas-Henderson-Paradise, NV"]
["29940","Lawrence, KS"]
["30020","Lawton, OK"]
["30140","Lebanon, PA"]
["30300","Lewiston, ID-WA"]
["30340","Lewiston-Auburn, ME"]
["30460","Lexington-Fayette, KY"]
["30620","Lima, OH"]
["30700","Lincoln, NE"]
["30780","Little Rock-North Little Rock-Conway, AR"]
["30860","Logan, UT-ID"]
["30980","Longview, TX"]
["31020","Longview, WA"]
["31084","Los Angeles-Long Beach-Glendale, CA"]
["31140","Louisville/Jefferson County, KY-IN"]
["31180","Lubbock, TX"]
["31340","Lynchburg, VA"]
["31420","Macon, GA"]
["31460","Madera, CA"]
["31540","Madison, WI"]
["31700","Manchester-Nashua, NH"]
["31740","Manhattan, KS"]
["31860","Mankato-North Mankato, MN"]
["31900","Mansfield, OH"]
["32420","Mayagüez, PR"]
["32580","McAllen-Edinburg-Mission, TX"]
["32780","Medford, OR"]
["32820","Memphis, TN-MS-AR"]
["32900","Merced, CA"]
["33124","Miami-Miami Beach-Kendall, FL"]
["33140","Michigan City-La Porte, IN"]
["33220","Midland, MI"]
["33260","Midland, TX"]
["33340","Milwaukee-Waukesha-West Allis, WI"]
["33460","Minneapolis-St. Paul-Bloomington, MN-WI"]
["33540","Missoula, MT"]
["33660","Mobile, AL"]
["33700","Modesto, CA"]
["33740","Monroe, LA"]
["33780","Monroe, MI"]
["33860","Montgomery, AL"]
["33874","Montgomery County-Bucks County-Chester County, PA"]
["34060","Morgantown, WV"]
["34100","Morristown, TN"]
["34580","Mount Vernon-Anacortes, WA"]
["34620","Muncie, IN"]
["34740","Muskegon, MI"]
["34820","Myrtle Beach-Conway-North Myrtle Beach, SC-NC"]
["34900","Napa, CA"]
["34940","Naples-Immokalee-Marco Island, FL"]
["34980","Nashville-Davidson--Murfreesboro--Franklin, TN"]
["35004","Nassau County-Suffolk County, NY"]
["35084","Newark, NJ-PA"]
["35100","New Bern, NC"]
["35300","New Haven-Milford, CT"]
["35380","New Orleans-Metairie, LA"]
["35614","New York-Jersey City-White Plains, NY-NJ"]
["35660","Niles-Benton Harbor, MI"]
["35840","North Port-Sarasota-Bradenton, FL"]
["35980","Norwich-New London, CT"]
["36084","Oakland-Hayward-Berkeley, CA"]
["36100","Ocala, FL"]
["36140","Ocean City, NJ"]
["36220","Odessa, TX"]
["36260","Ogden-Clearfield, UT"]
["36420","Oklahoma City, OK"]
["36500","Olympia-Tumwater, WA"]
["36540","Omaha-Council Bluffs, NE-IA"]
["36740","Orlando-Kissimmee-Sanford, FL"]
["36780","Oshkosh-Neenah, WI"]
["36980","Owensboro, KY"]
["37100","Oxnard-Thousand Oaks-Ventura, CA"]
["37340","Palm Bay-Melbourne-Titusville, FL"]
["37460","Panama City, FL"]
["37620","Parkersburg-Vienna, WV"]
["37860","Pensacola-Ferry Pass-Brent, FL"]
["37900","Peoria, IL"]
["37964","Philadelphia, PA"]
["38060","Phoenix-Mesa-Scottsdale, AZ"]
["38220","Pine Bluff, AR"]
["38300","Pittsburgh, PA"]
["38340","Pittsfield, MA"]
["38540","Pocatello, ID"]
["38660","Ponce, PR"]
["38860","Portland-South Portland, ME"]
["38900","Portland-Vancouver-Hillsboro, OR-WA"]
["38940","Port St. Lucie, FL"]
["39140","Prescott, AZ"]
["39300","Providence-Warwick, RI-MA"]
["39340","Provo-Orem, UT"]
["39380","Pueblo, CO"]
["39460","Punta Gorda, FL"]
["39540","Racine, WI"]
["39580","Raleigh, NC"]
["39660","Rapid City, SD"]
["39740","Reading, PA"]
["39820","Redding, CA"]
["39900","Reno, NV"]
["40060","Richmond, VA"]
["40140","Riverside-San Bernardino-Ontario, CA"]
["40220","Roanoke, VA"]
["40340","Rochester, MN"]
["40380","Rochester, NY"]
["40420","Rockford, IL"]
["40484","Rockingham County-Strafford County, NH"]
["40580","Rocky Mount, NC"]
["40660","Rome, GA"]
["40900","Sacramento--Roseville--Arden-Arcade, CA"]
["40980","Saginaw, MI"]
["41060","St. Cloud, MN"]
["41100","St. George, UT"]
["41140","St. Joseph, MO-KS"]
["41180","St. Louis, MO-IL"]
["41420","Salem, OR"]
["41500","Salinas, CA"]
["41540","Salisbury, MD-DE"]
["41620","Salt Lake City, UT"]
["41660","San Angelo, TX"]
["41700","San Antonio-New Braunfels, TX"]
["41740","San Diego-Carlsbad, CA"]
["41884","San Francisco-Redwood City-South San Francisco, CA"]
["41900","San Germán, PR"]
["41940","San Jose-Sunnyvale-Santa Clara, CA"]
["41980","San Juan-Carolina-Caguas, PR"]
["42020","San Luis Obispo-Paso Robles-Arroyo Grande, CA"]
["42034","San Rafael, CA"]
["42100","Santa Cruz-Watsonville, CA"]
["42140","Santa Fe, NM"]
["42200","Santa Maria-Santa Barbara, CA"]
["42220","Santa Rosa, CA"]
["42340","Savannah, GA"]
["42540","Scranton--Wilkes-Barre--Hazleton, PA"]
["42644","Seattle-Bellevue-Everett, WA"]
["42680","Sebastian-Vero Beach, FL"]
["42700","Sebring, FL"]
["43100","Sheboygan, WI"]
["43300","Sherman-Denison, TX"]
["43340","Shreveport-Bossier City, LA"]
["43420","Sierra Vista-Douglas, AZ"]
["43524","Silver Spring-Frederick-Rockville, MD"]
["43580","Sioux City, IA-NE-SD"]
["43620","Sioux Falls, SD"]
["43780","South Bend-Mishawaka, IN-MI"]
["43900","Spartanburg, SC"]
["44060","Spokane-Spokane Valley, WA"]
["44100","Springfield, IL"]
["44140","Springfield, MA"]
["44180","Springfield, MO"]
["44220","Springfield, OH"]
["44300","State College, PA"]
["44420","Staunton-Waynesboro, VA"]
["44700","Stockton-Lodi, CA"]
["44940","Sumter, SC"]
["45060","Syracuse, NY"]
["45104","Tacoma-Lakewood, WA"]
["45220","Tallahassee, FL"]
["45300","Tampa-St. Petersburg-Clearwater, FL"]
["45460","Terre Haute, IN"]
["45500","Texarkana, TX-AR"]
["45540","The Villages, FL"]
["45780","Toledo, OH"]
["45820","Topeka, KS"]
["45940","Trenton, NJ"]
["46060","Tucson, AZ"]
["46140","Tulsa, OK"]
["46220","Tuscaloosa, AL"]
["46340","Tyler, TX"]
["46520","Urban Honolulu, HI"]
["46540","Utica-Rome, NY"]
["46660","Valdosta, GA"]
["46700","Vallejo-Fairfield, CA"]
["47020","Victoria, TX"]
["47220","Vineland-Bridgeton, NJ"]
["47260","Virginia Beach-Norfolk-Newport News, VA-NC"]
["47300","Visalia-Porterville, CA"]
["47380","Waco, TX"]
["47460","Walla Walla, WA"]
["47580","Warner Robins, GA"]
["47664","Warren-Troy-Farmington Hills, MI"]
["47894","Washington-Arlington-Alexandria, DC-VA-MD-WV"]
["47940","Waterloo-Cedar Falls, IA"]
["48060","Watertown-Fort Drum, NY"]
["48140","Wausau, WI"]
["48260","Weirton-Steubenville, WV-OH"]
["48300","Wenatchee, WA"]
["48424","West Palm Beach-Boca Raton-Delray Beach, FL"]
["48540","Wheeling, WV-OH"]
["48620","Wichita, KS"]
["48660","Wichita Falls, TX"]
["48700","Williamsport, PA"]
["48864","Wilmington, DE-MD-NJ"]
["48900","Wilmington, NC"]
["49020","Winchester, VA-WV"]
["49180","Winston-Salem, NC"]
["49340","Worcester, MA-CT"]
["49420","Yakima, WA"]
["49620","York-Hanover, PA"]
["49660","Youngstown-Warren-Boardman, OH-PA"]
["49700","Yuba City, CA"]
["49740","Yuma, AZ"]
["99901","Rural - Alabama"]
["99902","Rural - Alaska"]
["99903","Rural - Arizona"]
["99904","Rural - Arkansas"]
["99905","Rural - California"]
["99906","Rural - Colorado"]
["99907","Rural - Connecticut"]
["99908","Rural - Delaware"]
["99910","Rural - Florida"]
["99911","Rural - Georgia"]
["99912","Rural - Hawaii"]
["99913","Rural - Idaho"]
["99914","Rural - Illinois"]
["99915","Rural - Indiana"]
["99916","Rural - Iowa"]
["99917","Rural - Kansas"]
["99918","Rural - Kentucky"]
["99919","Rural - Louisiana"]
["99920","Rural - Maine"]
["99921","Rural - Maryland"]
["99922","Rural - Massachusetts"]
["99923","Rural - Michigan"]
["99924","Rural - Minnesota"]
["99925","Rural - Mississippi"]
["99926","Rural - Missouri"]
["99927","Rural - Montana"]
["99928","Rural - Nebraska"]
["99929","Rural - Nevada"]
["99930","Rural - New Hampshire"]
["99932","Rural - New Mexico"]
["99933","Rural - New York"]
["99934","Rural - North Carolina"]
["99935","Rural - North Dakota"]
["99936","Rural - Ohio"]
["99937","Rural - Oklahoma"]
["99938","Rural - Oregon"]
["99939","Rural - Pennsylvania"]
["99940","Rural - Puerto Rico"]
["99942","Rural - South Carolina"]
["99943","Rural - South Dakota"]
["99944","Rural - Tennessee"]
["99945","Rural - Texas"]
["99946","Rural - Utah"]
["99947","Rural - Vermont"]
["99948","Rural - Virgin Islands"]
["99949","Rural - Virginia"]
["99950","Rural - Washington"]
["99951","Rural - West Virginia"]
["99952","Rural - Wisconsin"]
["99953","Rural - Wyoming"]
["99965","Rural - Guam"]
[16974,"Dupage County, IL"]
["99914","LaSalle County, IL"]
["99948","st. thomas, VI"]

{"sheet":"Source","index":22,"n_rows":12,"n_cols":2,"rows_kept":12,"cut":false,"hidden":true,"merged":[]}
["SNF PPS RUG RATE CALCULATOR WORKBOOK"]
[]
[null,"CMS-1696-F and CMS-1696-CN"]
[null,"Medicare Program: Prospective Payment System and Consolidated Billing for Skilled Nursing Facilities for FY 2019, Skilled Nursing Facilities Value-Based Purchasing Program, etc."]
[null,"Filed 7/31/2018"]
[null,"Published 8/8/2018"]
[null,"https://federalregister.gov/d/2018-16570"]
[null," "]
[]
[]
[]
["Web copy of spreadsheet is password protected - password CLA!12345"]