{"text_format":"1","workbook":"xlsx","n_sheets":23,"sheets":["FY 2021 SNF PDPM Rates","Alpha_Crosswalk","Base_Rates","Case-Mix_Rates","PT_Analysis","OT_Analysis","SLP_Analysis","Nursing_Analysis","NTA_Analysis","Case-Mix_Descriptions","VPD","PT","OT","SLP","NTA","Nursing","FY 2019 SNF PPS Rates","Data - Rates","Data - CBSA Codes","Data - Wage Indexes","Proof","Data - CBSA Designations","Source"],"not_rendered":{"charts":0,"images":3,"macros":0,"external_links":9,"defined_names":121,"comments":0,"pivot_tables":1},"unopened":[],"bounds":{"document_bytes":16777216,"sheet_cells":100000,"rows_first":2000,"rows_last":500,"rows_between":2000,"halvings":0,"cell_chars":16384,"cell_head_chars":4096},"cells_cut":0,"cells_raw":0,"read":"whole","date_system":"1900"}

{"sheet":"FY 2021 SNF PDPM Rates","index":0,"n_rows":47,"n_cols":20,"rows_kept":47,"cut":false,"hidden":false,"merged":[[44,2,44,15],[45,2,45,11],[2,18,2,21],[41,2,43,15],[2,1,2,16],[10,1,11,2],[10,3,11,4],[4,14,11,16],[31,2,31,5],[21,13,21,14],[26,13,26,14],[13,13,13,14],[13,10,13,11],[13,7,13,8],[27,13,27,14],[4,6,4,13],[29,13,29,15]]}
[]
[]
[null,"Skilled Nursing Medicare Part A FY 2021 SNF PPS PDPM RATES",null,null,null,null,null,null,null,null,null,null,null,null,null,null,null,null,"Tip"]
[null,null,null,null,null,null,null,null,null,null,null,null,null,null,null,null,null,null,null,"If all values are filtered out, click the clear filter"]
[null,null,null,null,null,null,"Select your state and county below:",null,null,null,null,null,null,null,"Rates are effective for services beginning 10/1/2020",null,null,null,null,"image in the top right corner of the slicer."]
[null,null,"Selected County:",{"$f":"'Data - Wage Indexes'!J1","v":"Select a county"}]
{"$rows_left_out":42}
{"sheet":"Alpha_Crosswalk","index":1,"n_rows":27,"n_cols":2,"rows_kept":27,"cut":false,"hidden":true,"merged":[]}
["Numeric","Alphabet"]
[1,"A"]
[2,"B"]
[3,"C"]
[4,"D"]
[5,"E"]
{"$rows_left_out":22}
{"sheet":"Base_Rates","index":2,"n_rows":27,"n_cols":7,"rows_kept":27,"cut":false,"hidden":true,"merged":[]}
[]
[null,"Nursing Case-Mix","NTA Case-Mix","PT Case-Mix","OT Case-Mix","SLP Case-Mix","Non-Case-Mix"]
["Urban",108.16,81.599999999999994,62.04,57.75,23.16,96.85]
["Rural",103.34,77.959999999999994,70.72,64.95,29.18,98.64]
["Note: Numbers come from Table 3 and Table 4 of FY 2021 final rule"]
[]
{"$rows_left_out":22}
{"sheet":"Case-Mix_Rates","index":3,"n_rows":27,"n_cols":20,"rows_kept":27,"cut":false,"hidden":true,"merged":[]}
["HIPPS_Code","PT/OT","PT CMI","PT Urban","PT Rural","OT CMI","OT Urban","OT Rural","SLP","SLP CMI","SLP Urban","SLP Rural","Nursing","Nursing CMI","Nursing Rate Urban","Nursing Rate Rural","NTA","NTA CMI","NTA Urban","NTA Rural"]
["A","TA",{"$f":"VLOOKUP($B2,PT!$C$6:$D$21,2,FALSE)","v":1.53},{"$f":"$C2*Base_Rates!$D$3","v":94.921199999999999},{"$f":"$C2*Base_Rates!$D$4","v":108.2016},{"$f":"VLOOKUP($B2,OT!$C$6:$D$21,2,FALSE)","v":1.49},{"$f":"$F2*Base_Rates!$E$3","v":86.047499999999999},{"$f":"$F2*Base_Rates!$E$4","v":96.775500000000008},"SA",{"$f":"VLOOKUP($I2,SLP!$C$6:$D$21,2,FALSE)","v":0.68},{"$f":"$J2*Base_Rates!$F$3","v":15.748800000000001},{"$f":"$J2*Base_Rates!$F$4","v":19.842400000000001},"ES3",{"$f":"VLOOKUP($M2,Nursing!$A$6:$C$36,3,FALSE)","v":4.0599999999999996},{"$f":"$N2*Base_Rates!$B$3","v":439.12959999999993},{"$f":"$N2*Base_Rates!$B$4","v":419.56039999999996},"NA",{"$f":"VLOOKUP($Q2,NTA!$B$6:$C$36,2,FALSE)","v":3.24},{"$f":"$R2*Base_Rates!$C$3","v":264.38400000000001},{"$f":"$R2*Base_Rates!$C$4","v":252.59039999999999}]
["B","TB",{"$f":"VLOOKUP($B3,PT!$C$6:$D$21,2,FALSE)","v":1.7},{"$f":"$C3*Base_Rates!$D$3","v":105.46799999999999},{"$f":"$C3*Base_Rates!$D$4","v":120.22399999999999},{"$f":"VLOOKUP($B3,OT!$C$6:$D$21,2,FALSE)","v":1.63},{"$f":"$F3*Base_Rates!$E$3","v":94.132499999999993},{"$f":"$F3*Base_Rates!$E$4","v":105.8685},"SB",{"$f":"VLOOKUP($I3,SLP!$C$6:$D$21,2,FALSE)","v":1.82},{"$f":"$J3*Base_Rates!$F$3","v":42.151200000000003},{"$f":"$J3*Base_Rates!$F$4","v":53.107599999999998},"ES2",{"$f":"VLOOKUP($M3,Nursing!$A$6:$C$36,3,FALSE)","v":3.07},{"$f":"$N3*Base_Rates!$B$3","v":332.05119999999999},{"$f":"$N3*Base_Rates!$B$4","v":317.25380000000001},"NB",{"$f":"VLOOKUP($Q3,NTA!$B$6:$C$36,2,FALSE)","v":2.5299999999999998},{"$f":"$R3*Base_Rates!$C$3","v":206.44799999999998},{"$f":"$R3*Base_Rates!$C$4","v":197.23879999999997}]
["C","TC",{"$f":"VLOOKUP($B4,PT!$C$6:$D$21,2,FALSE)","v":1.88},{"$f":"$C4*Base_Rates!$D$3","v":116.6352},{"$f":"$C4*Base_Rates!$D$4","v":132.95359999999999},{"$f":"VLOOKUP($B4,OT!$C$6:$D$21,2,FALSE)","v":1.69},{"$f":"$F4*Base_Rates!$E$3","v":97.597499999999997},{"$f":"$F4*Base_Rates!$E$4","v":109.7655},"SC",{"$f":"VLOOKUP($I4,SLP!$C$6:$D$21,2,FALSE)","v":2.67},{"$f":"$J4*Base_Rates!$F$3","v":61.837199999999996},{"$f":"$J4*Base_Rates!$F$4","v":77.910600000000002},"ES1",{"$f":"VLOOKUP($M4,Nursing!$A$6:$C$36,3,FALSE)","v":2.93},{"$f":"$N4*Base_Rates!$B$3","v":316.90879999999999},{"$f":"$N4*Base_Rates!$B$4","v":302.78620000000001},"NC",{"$f":"VLOOKUP($Q4,NTA!$B$6:$C$36,2,FALSE)","v":1.84},{"$f":"$R4*Base_Rates!$C$3","v":150.14400000000001},{"$f":"$R4*Base_Rates!$C$4","v":143.44639999999998}]
["D","TD",{"$f":"VLOOKUP($B5,PT!$C$6:$D$21,2,FALSE)","v":1.92},{"$f":"$C5*Base_Rates!$D$3","v":119.1168},{"$f":"$C5*Base_Rates!$D$4","v":135.7824},{"$f":"VLOOKUP($B5,OT!$C$6:$D$21,2,FALSE)","v":1.53},{"$f":"$F5*Base_Rates!$E$3","v":88.357500000000002},{"$f":"$F5*Base_Rates!$E$4","v":99.373500000000007},"SD",{"$f":"VLOOKUP($I5,SLP!$C$6:$D$21,2,FALSE)","v":1.46},{"$f":"$J5*Base_Rates!$F$3","v":33.813600000000001},{"$f":"$J5*Base_Rates!$F$4","v":42.602800000000002},"HDE2",{"$f":"VLOOKUP($M5,Nursing!$A$6:$C$36,3,FALSE)","v":2.4},{"$f":"$N5*Base_Rates!$B$3","v":259.584},{"$f":"$N5*Base_Rates!$B$4","v":248.01599999999999},"ND",{"$f":"VLOOKUP($Q5,NTA!$B$6:$C$36,2,FALSE)","v":1.33},{"$f":"$R5*Base_Rates!$C$3","v":108.52799999999999},{"$f":"$R5*Base_Rates!$C$4","v":103.68679999999999}]
["E","TE",{"$f":"VLOOKUP($B6,PT!$C$6:$D$21,2,FALSE)","v":1.42},{"$f":"$C6*Base_Rates!$D$3","v":88.096799999999988},{"$f":"$C6*Base_Rates!$D$4","v":100.4224},{"$f":"VLOOKUP($B6,OT!$C$6:$D$21,2,FALSE)","v":1.41},{"$f":"$F6*Base_Rates!$E$3","v":81.427499999999995},{"$f":"$F6*Base_Rates!$E$4","v":91.579499999999996},"SE",{"$f":"VLOOKUP($I6,SLP!$C$6:$D$21,2,FALSE)","v":2.34},{"$f":"$J6*Base_Rates!$F$3","v":54.194399999999995},{"$f":"$J6*Base_Rates!$F$4","v":68.281199999999998},"HDE1",{"$f":"VLOOKUP($M6,Nursing!$A$6:$C$36,3,FALSE)","v":1.99},{"$f":"$N6*Base_Rates!$B$3","v":215.23839999999998},{"$f":"$N6*Base_Rates!$B$4","v":205.64660000000001},"NE",{"$f":"VLOOKUP($Q6,NTA!$B$6:$C$36,2,FALSE)","v":0.96},{"$f":"$R6*Base_Rates!$C$3","v":78.335999999999999},{"$f":"$R6*Base_Rates!$C$4","v":74.841599999999985}]
{"$rows_left_out":22}
{"sheet":"PT_Analysis","index":4,"n_rows":54,"n_cols":17,"rows_kept":54,"cut":false,"hidden":true,"merged":[]}
[]
[null,"PT Component"]
[null,null,null,null,null,null,null,null,null,null,null,null,null,"Function Score"]
[null,"Clinical Category","Function Score","PT Case Mix Group","Function Score Code","CMI","Rate","Marginal Risk","Per 100 Days","Per 1,000 Days","Per 2,000 Days",null,"Clinical Category","0 to 5","6 to 9","10 to 23",24]
[null,"Major Joint Replacement or Spinal Surgery","0 to 5","TA",{"$f":"RIGHT(D5,1)","v":"A"},1.53,{"$f":"VLOOKUP(D5,'Case-Mix_Rates'!$B$2:$D$17,3,FALSE)","v":94.921199999999999},{"$f":"+G6-G5","v":10.54679999999999},{"$f":"+$H5*100","v":1054.6799999999989},{"$f":"+$H5*1000","v":10546.79999999999},{"$f":"+$H5*2000","v":21093.59999999998},null,"Major Joint Replacement or Spinal Surgery",1.53,1.69,1.88,1.92]
[null,"Major Joint Replacement or Spinal Surgery","6 to 9","TB",{"$f":"RIGHT(D6,1)","v":"B"},1.69,{"$f":"VLOOKUP(D6,'Case-Mix_Rates'!$B$2:$D$17,3,FALSE)","v":105.46799999999999},{"$f":"+G7-G6","v":11.167200000000008},{"$f":"+$H6*100","v":1116.7200000000007},{"$f":"+$H6*1000","v":11167.200000000008},{"$f":"+$H6*2000","v":22334.400000000016},null,"Other Orthopedic",1.42,1.61,1.67,1.1599999999999999]
{"$rows_left_out":49}
{"sheet":"OT_Analysis","index":5,"n_rows":41,"n_cols":16,"rows_kept":41,"cut":false,"hidden":true,"merged":[]}
[]
[null,"OT Component"]
[null,null,null,null,null,null,null,null,null,null,null,null,"Function Score"]
[null,"Clinical Category","Function Score","OT Case Mix Group","CMI","Rate","Marginal Risk","Per 100 Days","Per 1,000 Days","Per 2,000 Days",null,"Clinical Category","0 to 5","6 to 9","10 to 23",24]
[null,"Major Joint Replacement or Spinal Surgery","0 to 5","TA",{"$f":"VLOOKUP(D5,'Case-Mix_Rates'!$B$2:$H$17,5,FALSE)","v":1.49},{"$f":"VLOOKUP(D5,'Case-Mix_Rates'!$B$2:$H$17,6,FALSE)","v":86.047499999999999},{"$f":"+F8-F5","v":2.3100000000000023},{"$f":"+$G5*100","v":231.00000000000023},{"$f":"+$G5*1000","v":2310.0000000000023},{"$f":"+$G5*2000","v":4620.0000000000045},null,"Major Joint Replacement or Spinal Surgery (A-D)",1.49,1.63,1.68,1.53]
[null,"Major Joint Replacement or Spinal Surgery","6 to 9","TB",{"$f":"VLOOKUP(D6,'Case-Mix_Rates'!$B$2:$H$17,5,FALSE)","v":1.63},{"$f":"VLOOKUP(D6,'Case-Mix_Rates'!$B$2:$H$17,6,FALSE)","v":94.132499999999993},{"$f":"+F7-F6","v":3.4650000000000034},{"$f":"+$G6*100","v":346.50000000000034},{"$f":"+$G6*1000","v":3465.0000000000036},{"$f":"+$G6*2000","v":6930.0000000000073},null,"Other Orthopedic (E-H)",1.41,1.59,1.64,1.1499999999999999]
{"$rows_left_out":36}
{"sheet":"SLP_Analysis","index":6,"n_rows":98,"n_cols":15,"rows_kept":98,"cut":false,"hidden":true,"merged":[]}
[]
[null,"SLP Component"]
[null,null,null,null,null,null,null,null,null,null,null,null,{"$f":"C4","v":"Mechanically Altered Diet or Swallowing Disorder"}]
[null,"Presence of Acute Neurologic Condition, SLP-Related Comorbidity, or Cognitive Impairment","Mechanically Altered Diet or Swallowing Disorder","SLP\nCase Mix Group","CMI","Rate","Marginal Risk","Per 100 Days","Per 1,000 Days","Per 2,000 Days",null,{"$f":"B4","v":"Presence of Acute Neurologic Condition, SLP-Related Comorbidity, or Cognitive Impairment"},"Neither","Either","Both"]
[null,"None","Neither","SA",{"$f":"VLOOKUP(D5,'Case-Mix_Rates'!$I$2:$K$17,2,FALSE)","v":0.68},{"$f":"VLOOKUP(D5,'Case-Mix_Rates'!$I$2:$K$17,3,FALSE)","v":15.748800000000001},{"$f":"+F6-F5","v":26.4024},{"$f":"+$G5*100","v":2640.24},{"$f":"+$G5*1000","v":26402.400000000001},{"$f":"+$G5*2000","v":52804.800000000003},null,"None",0.68,1.82,2.66]
[null,"None","Either","SB",{"$f":"VLOOKUP(D6,'Case-Mix_Rates'!$I$2:$K$17,2,FALSE)","v":1.82},{"$f":"VLOOKUP(D6,'Case-Mix_Rates'!$I$2:$K$17,3,FALSE)","v":42.151200000000003},{"$f":"+F7-F6","v":19.685999999999993},{"$f":"+$G6*100","v":1968.5999999999992},{"$f":"+$G6*1000","v":19685.999999999993},{"$f":"+$G6*2000","v":39371.999999999985},null,"Any one",1.46,2.33,2.97]
{"$rows_left_out":93}
{"sheet":"Nursing_Analysis","index":7,"n_rows":124,"n_cols":17,"rows_kept":124,"cut":false,"hidden":true,"merged":[]}
[]
[null,"Nursing Component"]
[null,null,null,null,null,null,null,null,null,null,null,null,null,null,{"$f":"D4","v":"Function Score"}]
[null,"Nursing Category","Conditions/Services Present","Function Score","Nursing\nCase Mix Group","Function Score Code","CMI","Rate","Marginal Risk","Per 100 Days","Per 1,000 Days","Per 2,000 Days",null,"Special Care High","0-5","6-14","15-16"]
[null,"Extensive Services","Tracheostomy Care and Ventilator/Respirator","0-14","ES3",{"$f":"IF(LEN(E5)=4,MID(E5,2,2),IF(LEFT(E5,2)<>\"ES\",MID(E5,2,1),\"< 15\"))","v":"< 15"},{"$f":"VLOOKUP(E5,'Case-Mix_Rates'!$M$2:$O$35,2,FALSE)","v":4.0599999999999996},{"$f":"VLOOKUP(E5,'Case-Mix_Rates'!$M$2:$O$35,3,FALSE)","v":439.12959999999993},{"$f":"+H6-H5","v":-107.07839999999993},{"$f":"+$I5*100","v":-10707.839999999993},{"$f":"+$I5*1000","v":-107078.39999999994},{"$f":"+$I5*2000","v":-214156.79999999987},null,"Not Depressed",1.99,1.85]
[null,"Extensive Services","Tracheostomy Care or Ventilator/Respirator","0-14","ES2",{"$f":"IF(LEN(E6)=4,MID(E6,2,2),IF(LEFT(E6,2)<>\"ES\",MID(E6,2,1),\"< 15\"))","v":"< 15"},{"$f":"VLOOKUP(E6,'Case-Mix_Rates'!$M$2:$O$35,2,FALSE)","v":3.07},{"$f":"VLOOKUP(E6,'Case-Mix_Rates'!$M$2:$O$35,3,FALSE)","v":332.05119999999999},{"$f":"+H7-H6","v":-15.142400000000009},{"$f":"+$I6*100","v":-1514.2400000000009},{"$f":"+$I6*1000","v":-15142.400000000009},{"$f":"+$I6*2000","v":-30284.800000000017},null,"Depressed",2.39,2.23]
{"$rows_left_out":119}
{"sheet":"NTA_Analysis","index":8,"n_rows":63,"n_cols":14,"rows_kept":63,"cut":false,"hidden":true,"merged":[]}
[]
[null,"NTA Component"]
[]
[null,"NTA Comorbidity Score","NTA\nCase Mix Group","CMI","Rate","Marginal Risk","Per 100 Days","Per 1,000 Days","Per 2,000 Days",null,"Avg. Risk per Point","Avg. Rate per Point"]
[null,"12+","NA",{"$f":"VLOOKUP(C5,'Case-Mix_Rates'!$Q$2:$S$17,2,FALSE)","v":3.24},{"$f":"VLOOKUP(C5,'Case-Mix_Rates'!$Q$2:$S$17,3,FALSE)","v":264.38400000000001},{"$f":"+E5-E6","v":57.936000000000035},{"$f":"+$F5*100","v":5793.600000000004},{"$f":"+$F5*1000","v":57936.000000000036},{"$f":"+$F5*2000","v":115872.00000000007},null,{"$f":"F5","v":57.936000000000035},{"$f":"E5/12","v":22.032}]
[null,"9-11","NB",{"$f":"VLOOKUP(C6,'Case-Mix_Rates'!$Q$2:$S$17,2,FALSE)","v":2.5299999999999998},{"$f":"VLOOKUP(C6,'Case-Mix_Rates'!$Q$2:$S$17,3,FALSE)","v":206.44799999999998},{"$f":"+E5-E6","v":57.936000000000035},5793.600000000004,57936.000000000036,{"$f":"+$F6*2000","v":115872.00000000007},null,{"$f":"F6/3","v":19.312000000000012},{"$f":"E6/10","v":20.644799999999996}]
{"$rows_left_out":58}
{"sheet":"Case-Mix_Descriptions","index":9,"n_rows":63,"n_cols":4,"rows_kept":63,"cut":false,"hidden":true,"merged":[]}
[]
[null,"TA",{"$f":"PT!$A$5&\": \"&PT!A6&\"|\"&PT!$B$5&\": \"&PT!B6","v":"Clinical Category: Major Joint Replacement or Spinal Surgery|Function Score: 0-5"},{"$f":"PT!$A$5&\": \"&#REF!&\"|\"&PT!$B$5&\": \"&INDEX(PT!B6:E9,MATCH(#REF!,PT!E6:E9,1),1)","v":{"$error":"#REF!"}}]
[null,"TB",{"$f":"PT!$A$5&\": \"&PT!A7&\"|\"&PT!$B$5&\": \"&PT!B7","v":"Clinical Category: Major Joint Replacement or Spinal Surgery|Function Score: 6-9"},{"$f":"INDEX(B2:C17,MATCH(D2,C2:C17,0),1)","v":{"$error":"#REF!"}}]
[null,"TC",{"$f":"PT!$A$5&\": \"&PT!A8&\"|\"&PT!$B$5&\": \"&PT!B8","v":"Clinical Category: Major Joint Replacement or Spinal Surgery|Function Score: 10-23"}]
[null,"TD",{"$f":"PT!$A$5&\": \"&PT!A9&\"|\"&PT!$B$5&\": \"&PT!B9","v":"Clinical Category: Major Joint Replacement or Spinal Surgery|Function Score: 24"}]
[null,"TE",{"$f":"PT!$A$5&\": \"&PT!A10&\"|\"&PT!$B$5&\": \"&PT!B10","v":"Clinical Category: Other Orthopedic|Function Score: 0-5"}]
{"$rows_left_out":58}
{"sheet":"VPD","index":10,"n_rows":26,"n_cols":6,"rows_kept":26,"cut":false,"hidden":true,"merged":[]}
["PT & OT"]
["Day in Stay"]
[null,null,"Adjustment Factor","Days Remaining","Weighted Days"]
[1,20,1,{"$f":"MAX(#REF!-B4,0)","v":{"$error":"#REF!"}},{"$f":"MIN(B4,#REF!)*C4","v":{"$error":"#REF!"}}]
[{"$f":"+A4+20","v":21},{"$f":"+B4+7","v":27},{"$f":"+C4-0.02","v":0.98},{"$f":"MAX(#REF!-B5,0)","v":{"$error":"#REF!"}},{"$f":"IF(D5>0,(B5-B4)*C5,D4*C5)","v":{"$error":"#REF!"}}]
[{"$f":"+A5+7","v":28},{"$f":"+B5+7","v":34},{"$f":"+C5-0.02","v":0.96},{"$f":"MAX(#REF!-B6,0)","v":{"$error":"#REF!"}},{"$f":"IF(D6>0,(B6-B5)*C6,D5*C6)","v":{"$error":"#REF!"}}]
{"$rows_left_out":21}
{"sheet":"PT","index":11,"n_rows":22,"n_cols":10,"rows_kept":22,"cut":false,"hidden":true,"merged":[]}
["PDPM PT CMI : Physical Therapy Case Mix Indices"]
["Overview"]
[]
["PT Component",null,null,null,null,"Points Assigned to Section GG Responses (Except Walking)",null,null,"Points Assigned to Section GG Responses ( Walking Items)"]
["Clinical Category","Function Score","PT Case Mix Group","CMI",null,"Section GG Responses","Function Score ",null,"Section GG Responses","Function Score "]
["Major Joint Replacement or Spinal Surgery","0-5","TA",1.53,{"$f":"IFERROR(LEFT(B6,FIND(\"-\",B6)-1),B6)*1","v":0},"Independent",4,null,"Independent",4]
{"$rows_left_out":17}
{"sheet":"OT","index":12,"n_rows":22,"n_cols":10,"rows_kept":22,"cut":false,"hidden":true,"merged":[]}
["PDPM OT CMI : Occupational Therapy Case Mix Indices"]
["Overview"]
[]
["OT Component",null,null,null,null,"Points Assigned to Section GG Responses (Except Walking)",null,null,"Points Assigned to Section GG Responses ( Walking Items)"]
["Clinical Category","Function Score","OT Case Mix Group","CMI",null,"Section GG Responses","Function Score ",null,"Section GG Responses","Function Score "]
["Major Joint Replacement or Spinal Surgery","0-5","TA",1.49,null,"Independent",4,null,"Independent",4]
{"$rows_left_out":17}
{"sheet":"SLP","index":13,"n_rows":83,"n_cols":8,"rows_kept":83,"cut":false,"hidden":true,"merged":[]}
["PDPM SLP CMI : Speech-Language Pathology Case Mix Indices"]
["Overview"]
[]
["SLP Component",null,null,null,null,"Cognitive Impairment*"]
["Presence of Acute Neurologic Condition, SLP-Related Comorbidity, or Cognitive Impairment","Mechanically Altered Diet or Swallowing Disorder","SLP Case Mix Group","CMI",null,"PDPM Cognitive Level","BIMS Score","Staff Assessment Score"]
["None","Neither","SA",0.68,null,"1 - Cognitively Intact","13-15",0]
{"$rows_left_out":78}
{"sheet":"NTA","index":14,"n_rows":56,"n_cols":7,"rows_kept":56,"cut":false,"hidden":true,"merged":[]}
["PDPM NTA CMI : Non-Therapy Ancillary Case Mix Indices"]
["Overview"]
[]
["NTA Component",null,null,null,"Comorbidities Included in NTA Comorbidity Score and Assigned Points"]
["NTA Comorbidity Score","NTA Case Mix Group","CMI",null,"Condition/Extensive Service","MDS Item","Points"]
["12+","NA",3.24,{"$f":"IFERROR(LEFT(A6,FIND(\"-\",A6)-1)*1,12)","v":12},"HIV/AIDS ","SNF Claim ICD-10 B20",8]
{"$rows_left_out":51}
{"sheet":"Nursing","index":15,"n_rows":51,"n_cols":10,"rows_kept":51,"cut":false,"hidden":true,"merged":[]}
["PDPM Nursing CMI : Nursing Case Mix Indices"]
["Overview"]
[]
["Nursing Component",null,null,null,"Points Assigned to Section GG Responses (All Items Except Walking and Oral Hygiene Items)"]
["PDPM Nursing RUG","Function Score ","CMI",null,"Section GG Responses","Function Score "]
["ES3","0-14",4.0599999999999996,null,"Independent",4]
{"$rows_left_out":46}
{"sheet":"FY 2019 SNF PPS Rates","index":16,"n_rows":99,"n_cols":14,"rows_kept":99,"cut":false,"hidden":true,"merged":[[80,1,83,1],[84,1,92,1],[95,1,97,10],[28,1,36,1],[37,1,50,1],[51,1,53,1],[54,1,61,1],[62,1,69,1],[70,1,79,1],[15,2,15,3],[7,1,7,10],[11,2,11,3],[12,2,12,5],[13,2,13,5],[14,5,14,6]]}
[]
[]
[]
[]
[]
[]
{"$rows_left_out":94}
{"sheet":"Data - Rates","index":17,"n_rows":137,"n_cols":29,"rows_kept":137,"cut":false,"hidden":true,"merged":[]}
["Labor Index",0.70499999999999996,null,null,null,null,null,null,null,null,null,null,null,null,null,"Enter unadjusted federal rates from Federal Register here:","U",null,null,181.44,136.66999999999999,18,92.6]
["Non-Labor Index",{"$f":"1-B1","v":0.29500000000000004},null,null,null,null,null,null,null,null,null,null,null,null,null,null,"R",null,null,173.34,157.6,19.23,94.31]
[]
["RUG Category","Federal Rate","Labor Rate","Non-Labor Rate",null,null,null,null,null,null,null,null,null,null,null,null,"RUG Category","NI","TI","NC","TC","NCMTC","NCMC","Totsl",null,null,null,"FYP2019","FYF2018"]
["RUX-R",851.83999999999992,{"$f":"ROUND(B5*$B$1,2)","v":600.54999999999995},{"$f":"ROUND(B5-C5,2)","v":251.29},null,"RUX",851.83999999999992,600.54999999999995,251.29,{"$f":"H5/G5","v":0.70500328700225401},null,null,null,null,null,null,"RUX-R",2.67,1.87,{"$f":"ROUND(IF(RIGHT($Q5,1)=\"R\",T$2*R5,T$1*R5),2)","v":462.82},294.70999999999998,null,{"$f":"+$W$2","v":94.31},{"$f":"SUM(T5:W5)","v":851.83999999999992},null,null,"RUX-R",851.83999999999992,832.18999999999994]
["RUL-R",834.5,{"$f":"ROUND(B6*$B$1,2)","v":588.32000000000005},{"$f":"ROUND(B6-C6,2)","v":246.18},null,"RUL",834.5,588.32000000000005,246.18,0.70499700419412825,null,null,null,null,null,null,"RUL-R",2.57,1.87,445.48,294.70999999999998,null,{"$f":"+$W$2","v":94.31},{"$f":"SUM(T6:W6)","v":834.5},null,null,"RUL-R",834.5,815.25]
{"$rows_left_out":132}
{"sheet":"Data - CBSA Codes","index":18,"n_rows":3227,"n_cols":2,"rows_kept":3227,"cut":false,"hidden":true,"merged":[]}
["County, State","CBSA Code"]
["Click on the arrow to make your selection . . . "]
["Abbeville County, SC","99942"]
["Acadia Parish, LA","29180"]
["Accomack County, VA","99949"]
["Ada County, ID","14260"]
{"$rows_left_out":3222}
{"sheet":"Data - Wage Indexes","index":19,"n_rows":3222,"n_cols":10,"rows_kept":3222,"cut":false,"hidden":true,"merged":[]}
["County, State","Wage Index","CBSA Codes","CBSA Name",null,"State","County",null,null,{"$f":"IF(COUNTA(J3:J17)=1,J3&\", \"&I3,\"Select a county\")","v":"Select a county"}]
["Autauga, AL",0.76319999999999999,"33860","Montgomery, AL",null,"AL","Autauga",null,"State","County"]
["Baldwin, AL",0.71609999999999996,"19300","Daphne-Fairhope-Foley, AL",null,"AL","Baldwin",null,"SC","Calhoun"]
["Barbour, AL",0.6724,"99901","Alabama",null,"AL","Barbour",null,null,"Cherokee"]
["Bibb, AL",0.81469999999999998,"13820","Birmingham-Hoover, AL",null,"AL","Bibb",null,null,"Lee"]
["Blount, AL",0.81469999999999998,"13820","Birmingham-Hoover, AL",null,"AL","Blount",null,null,"Marion"]
{"$rows_left_out":3217}
{"sheet":"Proof","index":20,"n_rows":18,"n_cols":18,"rows_kept":18,"cut":false,"hidden":true,"merged":[]}
[{"$f":"'FY 2021 SNF PDPM Rates'!D9","v":""}]
[]
[null,null,"Component","Component Group","Component Rate","VPD adjustment factor","VPD adjustment rate",null,"Labor portion","Wage index","Wage index adjusted rate","Non-labor portion","Total case mix and wage index adjustment rate","VPDA adjustment factor","VPD adjustment rate",null,"Calculator","Variance"]
[null,null,"PT","TN",{"$f":"IF($A$1=\"Urban\",VLOOKUP(D4,'Case-Mix_Rates'!B$1:E$17,3,FALSE),VLOOKUP(D4,'Case-Mix_Rates'!B$1:E$17,4,FALSE))","v":104.6656},1,{"$f":"E4*F4","v":104.6656},null,{"$f":"G4*Base_Rates!$B$7","v":74.626572799999991},{"$f":"$F$15","v":1},{"$f":"I4*J4","v":74.626572799999991},{"$f":"G4-I4","v":30.039027200000007},{"$f":"SUM(K4:L4)","v":104.6656},1,{"$f":"M4/N4","v":104.6656},null,{"$f":"VLOOKUP(D4,'FY 2021 SNF PDPM Rates'!$C$15:$D$30,2,FALSE)","v":104.6656},{"$f":"+Q4-O4","v":0}]
[null,null,"OT","TN",{"$f":"IF($A$1=\"Urban\",VLOOKUP(D5,'Case-Mix_Rates'!B$1:H$17,6,FALSE),VLOOKUP(D5,'Case-Mix_Rates'!B$1:H$17,7,FALSE))","v":97.425000000000011},1,{"$f":"E5*F5","v":97.425000000000011},null,{"$f":"G5*Base_Rates!$B$7","v":69.464025000000007},1,69.464025000000007,27.960975000000005,97.425000000000011,1,{"$f":"M5/N5","v":97.425000000000011},null,{"$f":"VLOOKUP(D5,'FY 2021 SNF PDPM Rates'!$C$15:$E$30,3,FALSE)","v":97.425000000000011},0]
[null,null,"SLP","SH",{"$f":"IF($A$1=\"Urban\",VLOOKUP(D6,'Case-Mix_Rates'!I$1:L$17,3,FALSE),VLOOKUP(D6,'Case-Mix_Rates'!I$1:L$17,4,FALSE))","v":83.454799999999992},null,{"$f":"E6","v":83.454799999999992},null,{"$f":"G6*Base_Rates!$B$7","v":59.503272399999993},1,59.503272399999993,23.951527599999999,83.454799999999992,null,{"$f":"M6","v":83.454799999999992},null,{"$f":"VLOOKUP(D6,'FY 2021 SNF PDPM Rates'!$H$15:$I$30,2,FALSE)","v":83.454799999999992},0]
{"$rows_left_out":13}
{"sheet":"Data - CBSA Designations","index":21,"n_rows":464,"n_cols":2,"rows_kept":464,"cut":false,"hidden":true,"merged":[]}
["CBSA Code","CBSA Designation"]
["10180","Abilene, TX"]
["10380","Aguadilla-Isabela, PR"]
["10420","Akron, OH"]
["10500","Albany, GA"]
["10540","Albany, OR"]
{"$rows_left_out":459}
{"sheet":"Source","index":22,"n_rows":12,"n_cols":2,"rows_kept":12,"cut":false,"hidden":true,"merged":[]}
["SNF PPS RUG RATE CALCULATOR WORKBOOK"]
[]
[null,"CMS-1696-F and CMS-1696-CN"]
[null,"Medicare Program: Prospective Payment System and Consolidated Billing for Skilled Nursing Facilities for FY 2019, Skilled Nursing Facilities Value-Based Purchasing Program, etc."]
[null,"Filed 7/31/2018"]
[null,"Published 8/8/2018"]
{"$rows_left_out":6}